Vedlegg
type: ConceptScheme
description: Vedlegg på Fellestjenester BYGG.

Sluttrapport for avfallsplan
type: Concept
in scheme: Vedlegg
top concept of: Vedlegg
definition: Erstattes av "SluttrapportBygningsavfall" innen 1. september 2022.
description: Erstattes av "SluttrapportBygningsavfall" innen 1. september 2022.
status: Erstattet
temporal: PeriodeOfTime
  end date: 2022-09-01T00:00:00
broader: https://register.geonorge.no/kodelister/byggesoknad/vedlegg-og-underskjema/bokstav/K

Boligspesifikasjon i matrikkel
type: Concept
in scheme: Vedlegg
top concept of: Vedlegg
definition: Bør benytte skjema Matrikkelopplysninger i stedet for vedlegg.
description: Bør benytte skjema Matrikkelopplysninger i stedet for vedlegg.
status: Gyldig
broader: https://register.geonorge.no/kodelister/byggesoknad/vedlegg-og-underskjema/bokstav/H

Utomhusplan
type: Concept
in scheme: Vedlegg
top concept of: Vedlegg
definition: Disponeringen og utformingen av uteoppholdsarealet som viser at uteoppholdsarealet etter sin funksjon er egnet, skal dokumenteres på situasjonsplan, utomhusplan eller på annen egnet kartillustrasjon. Utomhusplanen er som regel mer detaljert enn situasjonsplanen, og skal vise uteoppholdsareal avsatt til hver enkelt bruksenhet og eventuelt til felles opphold. Planen må vise parkeringsplasser, regulerte lekeplasser, samt andre funksjoner som er regulert i gjeldende plan. Den skal også vise støttemurer, terrengarrondering og eventuelt viktig beplantning.
description: Disponeringen og utformingen av uteoppholdsarealet som viser at uteoppholdsarealet etter sin funksjon er egnet, skal dokumenteres på situasjonsplan, utomhusplan eller på annen egnet kartillustrasjon. Utomhusplanen er som regel mer detaljert enn situasjonsplanen, og skal vise uteoppholdsareal avsatt til hver enkelt bruksenhet og eventuelt til felles opphold. Planen må vise parkeringsplasser, regulerte lekeplasser, samt andre funksjoner som er regulert i gjeldende plan. Den skal også vise støttemurer, terrengarrondering og eventuelt viktig beplantning.
status: Gyldig
broader: https://register.geonorge.no/kodelister/byggesoknad/vedlegg-og-underskjema/bokstav/D

Søknad om ansvarsrett for selvbygger
type: Concept
in scheme: Vedlegg
top concept of: Vedlegg
definition: Dersom tiltakshaver skal søke om ansvarsrett for hele eller deler av arbeidet, må dette skjema vedlegges: «Søknad om personlig ansvarsrett som selvbygger av egen bolig eller fritidsbolig» (blankett nr. 5184).
description: Dersom tiltakshaver skal søke om ansvarsrett for hele eller deler av arbeidet, må dette skjema vedlegges: «Søknad om personlig ansvarsrett som selvbygger av egen bolig eller fritidsbolig» (blankett nr. 5184).
status: Gyldig
broader: https://register.geonorge.no/kodelister/byggesoknad/vedlegg-og-underskjema/bokstav/G

Foto
type: Concept
in scheme: Vedlegg
top concept of: Vedlegg
definition: Foto kan benyttes som en illustrasjon i forbindelse med en redegjørelse eller en begrunnelse.
description: Foto kan benyttes som en illustrasjon i forbindelse med en redegjørelse eller en begrunnelse.
status: Gyldig
broader: https://register.geonorge.no/kodelister/byggesoknad/vedlegg-og-underskjema/bokstav/Q

Avklaring av plassering nær høyspentledning
type: Concept
in scheme: Vedlegg
top concept of: Vedlegg
definition: Dersom tiltaket skal plasseres nær høyspentledninger, må plasseringen avklares med eier av ledningene. Nødvendig avstand til ledningene vil variere med type ledninger og størrelse på spenning. Behovet er å sikre mot brann og helsefarlig stråling.
description: Dersom tiltaket skal plasseres nær høyspentledninger, må plasseringen avklares med eier av ledningene. Nødvendig avstand til ledningene vil variere med type ledninger og størrelse på spenning. Behovet er å sikre mot brann og helsefarlig stråling.
status: Gyldig
broader: https://register.geonorge.no/kodelister/byggesoknad/vedlegg-og-underskjema/bokstav/Q

Nabomerknader
type: Concept
in scheme: Vedlegg
top concept of: Vedlegg
definition: Hvis naboer har merknader til tiltaket, skal merknadene sendes ansvarlig søker eller tiltakshaver innen 14 dager fra nabovarselet er sendt. Ansvarlig søker skal sende kopi av nabomerknadene til kommunen sammen med søknaden.
description: Hvis naboer har merknader til tiltaket, skal merknadene sendes ansvarlig søker eller tiltakshaver innen 14 dager fra nabovarselet er sendt. Ansvarlig søker skal sende kopi av nabomerknadene til kommunen sammen med søknaden.
status: Gyldig
broader: https://register.geonorge.no/kodelister/byggesoknad/vedlegg-og-underskjema/bokstav/C

Rekvisisjon av oppmålingsforretning
type: Concept
in scheme: Vedlegg
top concept of: Vedlegg
definition: Kan sendes sammen med Søknad om tillatelse til tiltak uten ansvarsrett. Blankett tilgjengelig hos Kartverket: https://www.kartverket.no/eiendom/fyll-ut-skjema/#matrikkelsaker
description: Kan sendes sammen med Søknad om tillatelse til tiltak uten ansvarsrett. Blankett tilgjengelig hos Kartverket: https://www.kartverket.no/eiendom/fyll-ut-skjema/#matrikkelsaker
status: Gyldig
broader: https://register.geonorge.no/kodelister/byggesoknad/vedlegg-og-underskjema/bokstav/J

Redegjørelse andre natur og miljøforhold
type: Concept
in scheme: Vedlegg
top concept of: Vedlegg
definition: Dersom tiltaket skal plasseres i et område med andre problematiske natur og miljøforhold som ikke dekkes i annet vedlegg, skal det legges ved en faglig redegjørelse fra en ekspert for hvordan forholdet til naturen skal ivaretas. Dette kan for eksempel være ivaretakelse av vernede naturtyper.
description: Dersom tiltaket skal plasseres i et område med andre problematiske natur og miljøforhold som ikke dekkes i annet vedlegg, skal det legges ved en faglig redegjørelse fra en ekspert for hvordan forholdet til naturen skal ivaretas. Dette kan for eksempel være ivaretakelse av vernede naturtyper.
status: Gyldig
broader: https://register.geonorge.no/kodelister/byggesoknad/vedlegg-og-underskjema/bokstav/F

Miljøsaneringsbeskrivelse
type: Concept
in scheme: Vedlegg
top concept of: Vedlegg
definition: Ved gjennomføring av tiltak i eksisterende byggverk skal det foretas kartlegging av bygningsdeler, installasjoner og lignende som kan utgjøre farlig avfall etter avfallsforskriften. Kravene til hva en miljøsaneringsbeskrivelse skal inneholde følger av TEK17 § 9-7 punkt 3. Erstattes av Rapport fra miljøkartlegging for søknader sendt fra 1. juli 2023.
description: Ved gjennomføring av tiltak i eksisterende byggverk skal det foretas kartlegging av bygningsdeler, installasjoner og lignende som kan utgjøre farlig avfall etter avfallsforskriften. Kravene til hva en miljøsaneringsbeskrivelse skal inneholde følger av TEK17 § 9-7 punkt 3. Erstattes av Rapport fra miljøkartlegging for søknader sendt fra 1. juli 2023.
status: Erstattet
broader: https://register.geonorge.no/kodelister/byggesoknad/vedlegg-og-underskjema/bokstav/K

Uttalelse fra kulturminnemyndigheten (fylkeskommunen)
type: Concept
in scheme: Vedlegg
top concept of: Vedlegg
definition: Kulturminnemyndigheten kan ha interesser i en byggesak enten fordi eiendommen er uregulert eller fordi det foreligger kulturminner. Som regel sender kommunen ut byggesaken til disse, men noen ganger har søker selv innhentet uttale på forhånd, og da benyttes denne vedleggstypen.
description: Kulturminnemyndigheten kan ha interesser i en byggesak enten fordi eiendommen er uregulert eller fordi det foreligger kulturminner. Som regel sender kommunen ut byggesaken til disse, men noen ganger har søker selv innhentet uttale på forhånd, og da benyttes denne vedleggstypen.
status: Gyldig
broader: https://register.geonorge.no/kodelister/byggesoknad/vedlegg-og-underskjema/bokstav/I

Opphør av ansvarsrett
type: Concept
in scheme: Vedlegg
top concept of: Vedlegg
definition: Dette vedlegget benyttes dersom ansvaret for et ansvarsområde avsluttes før arbeidet er ferdig. Det skal dokumentere hva som er gjort av arbeid og hva som står igjen.
description: Dette vedlegget benyttes dersom ansvaret for et ansvarsområde avsluttes før arbeidet er ferdig. Det skal dokumentere hva som er gjort av arbeid og hva som står igjen.
status: Gyldig
broader: https://register.geonorge.no/kodelister/byggesoknad/vedlegg-og-underskjema/bokstav/G

Kvittering for levert avfall
type: Concept
in scheme: Vedlegg
top concept of: Vedlegg
definition: I de tiltakene hvor det er krav om avfallsplan og avfallsrapport, skal alle kvitteringer for innlevert bygningsavfall sendes inn sammen med søknad om ferdigattest.
description: I de tiltakene hvor det er krav om avfallsplan og avfallsrapport, skal alle kvitteringer for innlevert bygningsavfall sendes inn sammen med søknad om ferdigattest.
status: Gyldig
broader: https://register.geonorge.no/kodelister/byggesoknad/vedlegg-og-underskjema/bokstav/K

Kommentar til nabomerknader
type: Concept
in scheme: Vedlegg
top concept of: Vedlegg
definition: Dersom det er kommet inn nabomerknader til tiltaket, skal ansvarlig søker kommentere disse og sende med søknaden til kommuen.
description: Dersom det er kommet inn nabomerknader til tiltaket, skal ansvarlig søker kommentere disse og sende med søknaden til kommuen.
status: Gyldig
broader: https://register.geonorge.no/kodelister/byggesoknad/vedlegg-og-underskjema/bokstav/C

Tegning nytt snitt
type: Concept
in scheme: Vedlegg
top concept of: Vedlegg
definition: Det skal legges ved tegninger av typiske snitt for det nye tiltaket. Dersom tiltaket omfatter endring av eksisterende bygning, skal snitttegningene vise hele bygningen i sammenheng.
description: Det skal legges ved tegninger av typiske snitt for det nye tiltaket. Dersom tiltaket omfatter endring av eksisterende bygning, skal snitttegningene vise hele bygningen i sammenheng.
status: Gyldig
broader: https://register.geonorge.no/kodelister/byggesoknad/vedlegg-og-underskjema/bokstav/E

Gjennomføringsplan
type: Concept
in scheme: Vedlegg
top concept of: Vedlegg
definition: Inneholder informasjon om ansvarsroller, status for gjennomføring, med mer.
description: Inneholder informasjon om ansvarsroller, status for gjennomføring, med mer.
status: Gyldig
broader: https://register.geonorge.no/kodelister/byggesoknad/vedlegg-og-underskjema/bokstav/G

Matrikkelopplysninger
type: Concept
in scheme: Vedlegg
top concept of: Vedlegg
definition: Strukturerte data om for samlede opplysninger om boligspesifikasjon matrikkel og bygningsopplysninger i opplysninger om tiltakets ytre rammer
description: Strukturerte data om for samlede opplysninger om boligspesifikasjon matrikkel og bygningsopplysninger i opplysninger om tiltakets ytre rammer
status: Gyldig
broader: https://register.geonorge.no/kodelister/byggesoknad/vedlegg-og-underskjema/bokstav/H

Redegjørelse estetikk
type: Concept
in scheme: Vedlegg
top concept of: Vedlegg
definition: Dersom tiltaket i seg selv eller tilpasningen til landskap og omkringliggende bebyggelse, er særlig utfordrende, bør det legges ved en redegjørelse for tiltakets visuelle utforming. Dette er særlig aktuelt der reguleringsplanen har bestemmelser for å sikre verneverdier i bygninger, andre kulturminner, og kulturmiljøer, herunder vern av fasade, materialbruk og interiør.
description: Dersom tiltaket i seg selv eller tilpasningen til landskap og omkringliggende bebyggelse, er særlig utfordrende, bør det legges ved en redegjørelse for tiltakets visuelle utforming. Dette er særlig aktuelt der reguleringsplanen har bestemmelser for å sikre verneverdier i bygninger, andre kulturminner, og kulturmiljøer, herunder vern av fasade, materialbruk og interiør.
status: Gyldig
broader: https://register.geonorge.no/kodelister/byggesoknad/vedlegg-og-underskjema/bokstav/F

Tegning ny plan
type: Concept
in scheme: Vedlegg
top concept of: Vedlegg
definition: Det skal legges ved plantegninger for alle etasjer i det nye tiltaket. Dersom tiltaket omfatter endring av eksisterende bygning, skal plantegningene vise hele bygningen i sammenheng.
description: Det skal legges ved plantegninger for alle etasjer i det nye tiltaket. Dersom tiltaket omfatter endring av eksisterende bygning, skal plantegningene vise hele bygningen i sammenheng.
status: Gyldig
broader: https://register.geonorge.no/kodelister/byggesoknad/vedlegg-og-underskjema/bokstav/E

Drenslinjekart
type: Concept
in scheme: Vedlegg
top concept of: Vedlegg
definition: Vedlegg for vurdering av fare for overvannsflom og plutselig flom
description: Vedlegg for vurdering av fare for overvannsflom og plutselig flom
status: Gyldig
broader: https://register.geonorge.no/kodelister/byggesoknad/vedlegg-og-underskjema/bokstav/F

Underlag for beregning av utnytting
type: Concept
in scheme: Vedlegg
top concept of: Vedlegg
definition: Dersom det ikke kommer tydelig fram av søknaden hvordan grad av utnytting er beregnet, kan dette utredes nærmere i eget vedlegg.
description: Dersom det ikke kommer tydelig fram av søknaden hvordan grad av utnytting er beregnet, kan dette utredes nærmere i eget vedlegg.
status: Gyldig
broader: https://register.geonorge.no/kodelister/byggesoknad/vedlegg-og-underskjema/bokstav/D

Nabovarsel
type: Concept
in scheme: Vedlegg
top concept of: Vedlegg
definition: "Nabovarsel" er dokumentet som sendes nabo. "Opplysninger gitt i nabovarsel" er et identisk dokument som sendes med til kommunen for å redegjøre for hva det er varslet naboene om. Bør benytte skjema gjenpart nabovarsel/opplysninger gitt i nabovarsel i stedet for vedlegg.
description: "Nabovarsel" er dokumentet som sendes nabo. "Opplysninger gitt i nabovarsel" er et identisk dokument som sendes med til kommunen for å redegjøre for hva det er varslet naboene om. Bør benytte skjema gjenpart nabovarsel/opplysninger gitt i nabovarsel i stedet for vedlegg.
status: Gyldig
broader: https://register.geonorge.no/kodelister/byggesoknad/vedlegg-og-underskjema/bokstav/C

Egenerklæring for selvbygger
type: Concept
in scheme: Vedlegg
top concept of: Vedlegg
definition: Egenerklæring for selvbygger (blankett 5187)
description: Egenerklæring for selvbygger (blankett 5187)
status: Gyldig
broader: https://register.geonorge.no/kodelister/byggesoknad/vedlegg-og-underskjema/bokstav/G

Tegning eksisterende plan
type: Concept
in scheme: Vedlegg
top concept of: Vedlegg
definition: Dersom tiltaket omfatter endring av eksisterende bebyggelse, skal det sendes inn tegninger over bygningen slik den er før nytt tiltak.
description: Dersom tiltaket omfatter endring av eksisterende bebyggelse, skal det sendes inn tegninger over bygningen slik den er før nytt tiltak.
status: Gyldig
broader: https://register.geonorge.no/kodelister/byggesoknad/vedlegg-og-underskjema/bokstav/E

Kvittering for nabovarsel
type: Concept
in scheme: Vedlegg
top concept of: Vedlegg
definition: Dette er et vedlegg som viser hvilke naboer som er varslet.
description: Dette er et vedlegg som viser hvilke naboer som er varslet.
status: Gyldig
broader: https://register.geonorge.no/kodelister/byggesoknad/vedlegg-og-underskjema/bokstav/C

Dispensasjonssøknad/vedtak
type: Concept
in scheme: Vedlegg
top concept of: Vedlegg
definition: Begrunnet søknad om dispensasjon hvis dette ikke er gitt i selve søknaden, alternativt vedtak om innvilget dispensasjon der dette er gitt på forhånd.
description: Begrunnet søknad om dispensasjon hvis dette ikke er gitt i selve søknaden, alternativt vedtak om innvilget dispensasjon der dette er gitt på forhånd.
status: Gyldig
broader: https://register.geonorge.no/kodelister/byggesoknad/vedlegg-og-underskjema/bokstav/B

Samtykke til plassering nærmere enn 4 meter
type: Concept
in scheme: Vedlegg
top concept of: Vedlegg
definition: Et byggverk skal normalt plasseres minst 4 meter fra nabogrense hvis ikke annet er bestemt i reguleringsplan. Dette følger av plan- og bygningslovens § 29-4. Kommunen kan godkjenne en nærmere plassering dersom det foreligger et skriftlig samtykke fra nabo. Samtykket må være skriftlig og klart formulert og foreligge på vedtakstidspunktet. Videre må nabosamtykket være formulert slik at det ikke oppstår tvil om hva det gjelder. Det må derfor foreligge en samtykkeerklæring der det uttrykkelig fremgår at naboen samtykker til at et konkret tiltak plasseres nærmere nabogrensen enn 4 meter.
description: Et byggverk skal normalt plasseres minst 4 meter fra nabogrense hvis ikke annet er bestemt i reguleringsplan. Dette følger av plan- og bygningslovens § 29-4. Kommunen kan godkjenne en nærmere plassering dersom det foreligger et skriftlig samtykke fra nabo. Samtykket må være skriftlig og klart formulert og foreligge på vedtakstidspunktet. Videre må nabosamtykket være formulert slik at det ikke oppstår tvil om hva det gjelder. Det må derfor foreligge en samtykkeerklæring der det uttrykkelig fremgår at naboen samtykker til at et konkret tiltak plasseres nærmere nabogrensen enn 4 meter.
status: Gyldig
broader: https://register.geonorge.no/kodelister/byggesoknad/vedlegg-og-underskjema/bokstav/Q

Rapport fra miljøkartlegging
type: Concept
in scheme: Vedlegg
top concept of: Vedlegg
definition: Ved endring eller riving av eksisterende byggverk er det krav om kartlegging av farlig avfall og til å utarbeide rapport fra miljøkartleggingen. For krav til innhold i rapporten, se TEK § 9-7, 4. ledd. Erstatter Miljøsaneringsbeskrivelse for søknader sendt etter 1. juli 2023.
description: Ved endring eller riving av eksisterende byggverk er det krav om kartlegging av farlig avfall og til å utarbeide rapport fra miljøkartleggingen. For krav til innhold i rapporten, se TEK § 9-7, 4. ledd. Erstatter Miljøsaneringsbeskrivelse for søknader sendt etter 1. juli 2023.
status: Gyldig
broader: https://register.geonorge.no/kodelister/byggesoknad/vedlegg-og-underskjema/bokstav/K

Redegjørelse grunnforhold
type: Concept
in scheme: Vedlegg
top concept of: Vedlegg
definition: Dersom tiltaket skal plasseres i et område med utfordrende grunnforhold, skal det legges ved en faglig redegjørelse fra en ekspert for hvordan sikkerheten skal ivaretas.
description: Dersom tiltaket skal plasseres i et område med utfordrende grunnforhold, skal det legges ved en faglig redegjørelse fra en ekspert for hvordan sikkerheten skal ivaretas.
status: Gyldig
broader: https://register.geonorge.no/kodelister/byggesoknad/vedlegg-og-underskjema/bokstav/F

Sluttrapport for bygningsavfall
type: Concept
in scheme: Vedlegg
top concept of: Vedlegg
definition: Erstatter vedleggstypen "SluttrapportForAvfallsplan" 1. september 2022.
description: Erstatter vedleggstypen "SluttrapportForAvfallsplan" 1. september 2022.
status: Gyldig
broader: https://register.geonorge.no/kodelister/byggesoknad/vedlegg-og-underskjema/bokstav/K

Tegning ny fasade
type: Concept
in scheme: Vedlegg
top concept of: Vedlegg
definition: Det skal legges ved tegninger av alle fasader for det nye tiltaket. Dersom tiltaket omfatter endring av eksisterende bygning, skal fasadetegningene vise hele bygningen i sammenheng. Fasadetegningene skal vise eksisterende terrenglinjer og nytt arrondert terreng.
description: Det skal legges ved tegninger av alle fasader for det nye tiltaket. Dersom tiltaket omfatter endring av eksisterende bygning, skal fasadetegningene vise hele bygningen i sammenheng. Fasadetegningene skal vise eksisterende terrenglinjer og nytt arrondert terreng.
status: Gyldig
broader: https://register.geonorge.no/kodelister/byggesoknad/vedlegg-og-underskjema/bokstav/E

ByggesaksBIM
type: Concept
in scheme: Vedlegg
top concept of: Vedlegg
definition: Se krav til byggesaksBIM: https://dibk.atlassian.net/wiki/spaces/FB/pages/52007820/BIM+i+byggesak
description: Se krav til byggesaksBIM: https://dibk.atlassian.net/wiki/spaces/FB/pages/52007820/BIM+i+byggesak
status: Gyldig
broader: https://register.geonorge.no/kodelister/byggesoknad/vedlegg-og-underskjema/bokstav/E

Tegning eksisterende fasade
type: Concept
in scheme: Vedlegg
top concept of: Vedlegg
definition: Dersom tiltaket omfatter endring av eksisterende bebyggelse, skal det sendes inn tegninger over bygningen slik den er før nytt tiltak.
description: Dersom tiltaket omfatter endring av eksisterende bebyggelse, skal det sendes inn tegninger over bygningen slik den er før nytt tiltak.
status: Gyldig
broader: https://register.geonorge.no/kodelister/byggesoknad/vedlegg-og-underskjema/bokstav/E

Avklaring av plassering nær VA-ledninger
type: Concept
in scheme: Vedlegg
top concept of: Vedlegg
definition: Dersom tiltaket skal plasseres nær vann- eller avløpsledninger, må plasseringen avklares med eier av ledningene. Nødvendig avstand til ledningene vil variere med type ledninger og grunnforhold. Behovet er å kunne vedlikeholde ledningene også etter gjennomført tiltak.
description: Dersom tiltaket skal plasseres nær vann- eller avløpsledninger, må plasseringen avklares med eier av ledningene. Nødvendig avstand til ledningene vil variere med type ledninger og grunnforhold. Behovet er å kunne vedlikeholde ledningene også etter gjennomført tiltak.
status: Gyldig
broader: https://register.geonorge.no/kodelister/byggesoknad/vedlegg-og-underskjema/bokstav/Q

Følgebrev
type: Concept
in scheme: Vedlegg
top concept of: Vedlegg
definition: Mange ønsker å kunne lage et eget følgebrev til søknaden for å belyse forhold som for øvrig ikke kommer fram fra søknaden for øvrig.
description: Mange ønsker å kunne lage et eget følgebrev til søknaden for å belyse forhold som for øvrig ikke kommer fram fra søknaden for øvrig.
status: Gyldig
broader: https://register.geonorge.no/kodelister/byggesoknad/vedlegg-og-underskjema/bokstav/F

Uttalelse vedtak fra annen offentlig myndighet
type: Concept
in scheme: Vedlegg
top concept of: Vedlegg
definition: Det er 15 sektormyndigheter som kan ha interesser i en byggesak. Som regel sender kommunen ut byggesaken til disse, men noen ganger har søker selv innhentet uttale på forhånd, og da benyttes denne vedleggstypen.
description: Det er 15 sektormyndigheter som kan ha interesser i en byggesak. Som regel sender kommunen ut byggesaken til disse, men noen ganger har søker selv innhentet uttale på forhånd, og da benyttes denne vedleggstypen.
status: Gyldig
broader: https://register.geonorge.no/kodelister/byggesoknad/vedlegg-og-underskjema/bokstav/I

Avkjørselsplan
type: Concept
in scheme: Vedlegg
top concept of: Vedlegg
definition: Der det skal anlegges ny adkomst, skal det legges ved en avkjørselsplan som viser utkjøring til offentlig vei.
description: Der det skal anlegges ny adkomst, skal det legges ved en avkjørselsplan som viser utkjøring til offentlig vei.
status: Gyldig
broader: https://register.geonorge.no/kodelister/byggesoknad/vedlegg-og-underskjema/bokstav/D

Redegjørelse for unntak fra TEK
type: Concept
in scheme: Vedlegg
top concept of: Vedlegg
definition: Dette vedlegget gjelder kun der det søkes tiltak på eksisterende bebyggelse. Plan- og bygningslovens § 31-2 gir kommunen hjemmel til å kunne unnta tiltaket fra enkelte bestemmelser i TEK der dette er særlig vanskelig og kostbart å oppfylle på grunn av den eksisterende bebyggelsen.
description: Dette vedlegget gjelder kun der det søkes tiltak på eksisterende bebyggelse. Plan- og bygningslovens § 31-2 gir kommunen hjemmel til å kunne unnta tiltaket fra enkelte bestemmelser i TEK der dette er særlig vanskelig og kostbart å oppfylle på grunn av den eksisterende bebyggelsen.
status: Gyldig
broader: https://register.geonorge.no/kodelister/byggesoknad/vedlegg-og-underskjema/bokstav/B

Plan for uavhengig kontroll
type: Concept
in scheme: Vedlegg
top concept of: Vedlegg
definition: Ansvarlig kontrollerende skal lage en plan for den uavhengig kontrollen som skal gjennomføres i tiltaket. Planen skal normalt ikke sendes inn, men kommunen kan etterspørre den ved tilsyn.
description: Ansvarlig kontrollerende skal lage en plan for den uavhengig kontrollen som skal gjennomføres i tiltaket. Planen skal normalt ikke sendes inn, men kommunen kan etterspørre den ved tilsyn.
status: Gyldig
broader: https://register.geonorge.no/kodelister/byggesoknad/vedlegg-og-underskjema/bokstav/G

Søknad om ansvarsrett for tiltaksklasse 1
type: Concept
in scheme: Vedlegg
top concept of: Vedlegg
definition: Det kan søkes kommunen om ansvarsrett for utførende i tiltaksklasse 1 selv om foretaket ikke tilfredsstiller de formelle kravene til å erklære ansvar.
description: Det kan søkes kommunen om ansvarsrett for utførende i tiltaksklasse 1 selv om foretaket ikke tilfredsstiller de formelle kravene til å erklære ansvar.
status: Gyldig
broader: https://register.geonorge.no/kodelister/byggesoknad/vedlegg-og-underskjema/bokstav/G

Andre redegjørelser
type: Concept
in scheme: Vedlegg
top concept of: Vedlegg
definition: Redegjørelser som ikke dekkes av de andre vedleggene for redegjørelser (skred og flomfare, andre natur- og miljøforhold, grunnforhold, estetikk og forurenset grunn).
description: Redegjørelser som ikke dekkes av de andre vedleggene for redegjørelser (skred og flomfare, andre natur- og miljøforhold, grunnforhold, estetikk og forurenset grunn).
status: Gyldig
broader: https://register.geonorge.no/kodelister/byggesoknad/vedlegg-og-underskjema/bokstav/F

Erklæring om ansvarsrett
type: Concept
in scheme: Vedlegg
top concept of: Vedlegg
definition: Signerte vedlegg av erklæring om ansvarsrett.
description: Signerte vedlegg av erklæring om ansvarsrett.
status: Gyldig
broader: https://register.geonorge.no/kodelister/byggesoknad/vedlegg-og-underskjema/bokstav/G

Tegning eksisterende snitt
type: Concept
in scheme: Vedlegg
top concept of: Vedlegg
definition: Dersom tiltaket omfatter endring av eksisterende bebyggelse, skal det sendes inn tegninger over bygningen slik den er før nytt tiltak.
description: Dersom tiltaket omfatter endring av eksisterende bebyggelse, skal det sendes inn tegninger over bygningen slik den er før nytt tiltak.
status: Gyldig
broader: https://register.geonorge.no/kodelister/byggesoknad/vedlegg-og-underskjema/bokstav/E

Gjenpart nabovarsel
type: Concept
in scheme: Vedlegg
top concept of: Vedlegg
definition: Gjenpart av nabovarsel gir en oversikt over opplysninger gitt i nabovarsel, naboer som er varslet og status for merknader.
description: Gjenpart av nabovarsel gir en oversikt over opplysninger gitt i nabovarsel, naboer som er varslet og status for merknader.
status: Gyldig
broader: https://register.geonorge.no/kodelister/byggesoknad/vedlegg-og-underskjema/bokstav/C

Tiltakshavers samtykke til byggeplaner
type: Concept
in scheme: Vedlegg
top concept of: Vedlegg
definition: Dette vedlegget representerer tiltakshavers signatur som bekrefter at de formelt står ansvarlig for tiltaket. Det skal sendes inn med den første søknaden i byggesaken.
description: Dette vedlegget representerer tiltakshavers signatur som bekrefter at de formelt står ansvarlig for tiltaket. Det skal sendes inn med den første søknaden i byggesaken.
status: Gyldig
broader: https://register.geonorge.no/kodelister/byggesoknad/vedlegg-og-underskjema/bokstav/G

Annet
type: Concept
in scheme: Vedlegg
top concept of: Vedlegg
definition: Her legges vedlegg som ikke passer inn i noen av de andre vedleggstypene.
description: Her legges vedlegg som ikke passer inn i noen av de andre vedleggstypene.
status: Gyldig
broader: https://register.geonorge.no/kodelister/byggesoknad/vedlegg-og-underskjema/bokstav/Q

Situasjonsplan
type: Concept
in scheme: Vedlegg
top concept of: Vedlegg
definition: Situasjonplan et situasjonskart med påtegnet planlagt tiltak. Hovedmål på tiltaket skal tegnes inn samt avstand til nærmeste grense, eksisterende bygning og avstand til midt vei. Situasjonsplanen skal også vise VA-anlegg med påkoblingspunkt for ny bebyggelse.
description: Situasjonplan et situasjonskart med påtegnet planlagt tiltak. Hovedmål på tiltaket skal tegnes inn samt avstand til nærmeste grense, eksisterende bygning og avstand til midt vei. Situasjonsplanen skal også vise VA-anlegg med påkoblingspunkt for ny bebyggelse.
status: Gyldig
broader: https://register.geonorge.no/kodelister/byggesoknad/vedlegg-og-underskjema/bokstav/D

Kart
type: Concept
in scheme: Vedlegg
top concept of: Vedlegg
definition: Kart kan vedlegges dersom ansvarlig søker ønsker å illustrere spesielle forhold. Det er ikke et obligatorisk vedlegg. NB: Må ikke forveksles med situasjonsplan, som er et obligatorisk vedlegg i alle byggesaker.
description: Kart kan vedlegges dersom ansvarlig søker ønsker å illustrere spesielle forhold. Det er ikke et obligatorisk vedlegg. NB: Må ikke forveksles med situasjonsplan, som er et obligatorisk vedlegg i alle byggesaker.
status: Gyldig
broader: https://register.geonorge.no/kodelister/byggesoknad/vedlegg-og-underskjema/bokstav/F

Redegjørelse forurenset grunn
type: Concept
in scheme: Vedlegg
top concept of: Vedlegg
definition: Dersom tiltaket skal plasseres i et område med forurenset grunn, skal det legges ved en faglig redegjørelse fra en ekspert for hvordan sikkerheten skal ivaretas.
description: Dersom tiltaket skal plasseres i et område med forurenset grunn, skal det legges ved en faglig redegjørelse fra en ekspert for hvordan sikkerheten skal ivaretas.
status: Gyldig
broader: https://register.geonorge.no/kodelister/byggesoknad/vedlegg-og-underskjema/bokstav/F

Samtykke fra Arbeidstilsynet
type: Concept
in scheme: Vedlegg
top concept of: Vedlegg
definition: Arbeidstilsynet skal godkjenne alle bygg som skal inneholde arbeidsplasser. Godkjenning skal foreligge før det gis igangsettingstillatelse. Samtykke fra Arbeidstilsynet lastes opp under denne vedleggstypen.
description: Arbeidstilsynet skal godkjenne alle bygg som skal inneholde arbeidsplasser. Godkjenning skal foreligge før det gis igangsettingstillatelse. Samtykke fra Arbeidstilsynet lastes opp under denne vedleggstypen.
status: Gyldig
broader: https://register.geonorge.no/kodelister/byggesoknad/vedlegg-og-underskjema/bokstav/I

Redegjørelse skred og flomfare
type: Concept
in scheme: Vedlegg
top concept of: Vedlegg
definition: Dersom tiltaket skal plasseres i et område med skred eller flomfare, skal det legges ved en faglig redegjørelse fra en ekspert for hvordan sikkerheten skal ivaretas.
description: Dersom tiltaket skal plasseres i et område med skred eller flomfare, skal det legges ved en faglig redegjørelse fra en ekspert for hvordan sikkerheten skal ivaretas.
status: Gyldig
broader: https://register.geonorge.no/kodelister/byggesoknad/vedlegg-og-underskjema/bokstav/F

Avkjøringstillatelse fra vegmyndigheten
type: Concept
in scheme: Vedlegg
top concept of: Vedlegg
definition: Der det skal anlegges ny adkomst fra offentlig vei, skal avkjøringen godkjennes av veimyndigheten. Som regel sender kommunen ut søknad om ny avkjøring til veimyndigheten, men noen ganger har søker selv innhentet tillatelse på forhånd, og da benyttes denne vedleggstypen.
description: Der det skal anlegges ny adkomst fra offentlig vei, skal avkjøringen godkjennes av veimyndigheten. Som regel sender kommunen ut søknad om ny avkjøring til veimyndigheten, men noen ganger har søker selv innhentet tillatelse på forhånd, og da benyttes denne vedleggstypen.
status: Gyldig
broader: https://register.geonorge.no/kodelister/byggesoknad/vedlegg-og-underskjema/bokstav/I