Tegneregler
type: ConceptScheme
description: Inneholder PDF-dokumenter med tegneregler og kartografi

Hydrologiske data
type: Concept
in scheme: Tegneregler
top concept of: Tegneregler
definition: Dokumentet gir en presentasjon over anbefalt kartografi ved bruk av datasettet Hydrologiske data
description: Dokumentet gir en presentasjon over anbefalt kartografi ved bruk av datasettet Hydrologiske data
status: Gyldig

Sårbare marine biotoper – modellert utbredelse Hardbunnskorallskog
type: Concept
in scheme: Tegneregler
top concept of: Tegneregler
definition: Dokumentet gir en presentasjon over anbefalt kartografi ved bruk av datasettet.
description: Dokumentet gir en presentasjon over anbefalt kartografi ved bruk av datasettet.
status: Gyldig

Fiskerihavner
type: Concept
in scheme: Tegneregler
top concept of: Tegneregler
definition: Dokumentet gir en presentasjon over anbefalt kartografi ved bruk av datasettet Fiskerihavner
description: Dokumentet gir en presentasjon over anbefalt kartografi ved bruk av datasettet Fiskerihavner
status: Gyldig

Vegetasjon
type: Concept
in scheme: Tegneregler
top concept of: Tegneregler
definition: Dokumentet gir en presentasjon over anbefalt kartografi ved bruk av datasettet Vegetasjon
description: Dokumentet gir en presentasjon over anbefalt kartografi ved bruk av datasettet Vegetasjon
status: Gyldig

N50 Kartdata
type: Concept
in scheme: Tegneregler
top concept of: Tegneregler
definition: Dokumentet gir en presentasjon over anbefalt kartografi ved bruk av datasettet N50 Kartdata.
description: Dokumentet gir en presentasjon over anbefalt kartografi ved bruk av datasettet N50 Kartdata.
status: Gyldig

Naturtyper_HB13
type: Concept
in scheme: Tegneregler
top concept of: Tegneregler
definition: Dokumentet gir en presentasjon over anbefalt kartografi ved bruk av datasettet Naturtyper - DN-håndbok 13
description: Dokumentet gir en presentasjon over anbefalt kartografi ved bruk av datasettet Naturtyper - DN-håndbok 13
status: Gyldig

Nedbørfelt - REGINE
type: Concept
in scheme: Tegneregler
top concept of: Tegneregler
definition: Dokumentet gir en presentasjon over anbefalt kartografi ved bruk av datasettet Nedbørfelt/Regine
description: Dokumentet gir en presentasjon over anbefalt kartografi ved bruk av datasettet Nedbørfelt/Regine
status: Gyldig

DTM Terrengmodell
type: Concept
in scheme: Tegneregler
top concept of: Tegneregler
definition: Dokumentet gir en presentasjon over anbefalt kartografi ved bruk av datasettet.
description: Dokumentet gir en presentasjon over anbefalt kartografi ved bruk av datasettet.
status: Gyldig

Bunnsedimenter (kornstørrelse), detaljert
type: Concept
in scheme: Tegneregler
top concept of: Tegneregler
definition: Dokumentet gir en presentasjon over anbefalt kartografi ved bruk av datasett Bunnsedimenter (kornstørrelse) - detaljert. Viser kornstørrelsessammensetning i sjøbunnssedimentenes øvre del (øverste 0-50 cm av sjøbunnen).
description: Dokumentet gir en presentasjon over anbefalt kartografi ved bruk av datasett Bunnsedimenter (kornstørrelse) - detaljert. Viser kornstørrelsessammensetning i sjøbunnssedimentenes øvre del (øverste 0-50 cm av sjøbunnen).
status: Gyldig

Kartlagte og verdsatte friluftslivsområder
type: Concept
in scheme: Tegneregler
top concept of: Tegneregler
status: Gyldig

Sårbare marine bunndyr - observasjonsdata Bløtbunnkorallskog
type: Concept
in scheme: Tegneregler
top concept of: Tegneregler
definition: Dokumentet gir en presentasjon over anbefalt kartografi ved bruk av datasettet.
description: Dokumentet gir en presentasjon over anbefalt kartografi ved bruk av datasettet.
status: Gyldig

Dybdedata terrengmodeller
type: Concept
in scheme: Tegneregler
top concept of: Tegneregler
definition: Dokumentet gir en presentasjon over anbefalt kartografi ved bruk av datasettet "Dybdedata terrengmodeller"
description: Dokumentet gir en presentasjon over anbefalt kartografi ved bruk av datasettet "Dybdedata terrengmodeller"
status: Gyldig

Organiske miljøgifter i marine sedimenter
type: Concept
in scheme: Tegneregler
top concept of: Tegneregler
definition: Dokumentet gir en presentasjon over anbefalt kartografi ved bruk av datasettet.
description: Dokumentet gir en presentasjon over anbefalt kartografi ved bruk av datasettet.
status: Gyldig

FKB Transaksjoner WMS-T
type: Concept
in scheme: Tegneregler
top concept of: Tegneregler
definition: Dokumentet gir en presentasjon over anbefalt kartografi.
description: Dokumentet gir en presentasjon over anbefalt kartografi.
status: Gyldig

Naturvernområder
type: Concept
in scheme: Tegneregler
top concept of: Tegneregler
status: Gyldig

Reindrift - Reinbeiteområde
type: Concept
in scheme: Tegneregler
top concept of: Tegneregler
definition: Dokumentet gir en presentasjon over anbefalt kartografi ved bruk av datasettet Reindrift Reinbeiteområde.
description: Dokumentet gir en presentasjon over anbefalt kartografi ved bruk av datasettet Reindrift Reinbeiteområde.
status: Gyldig

Befolkning på rutenett 250m
type: Concept
in scheme: Tegneregler
top concept of: Tegneregler
definition: Dokumentet gir en presentasjon over anbefalt kartografi ved bruk av datasettet "Befolkning på rutenett 250m"
description: Dokumentet gir en presentasjon over anbefalt kartografi ved bruk av datasettet "Befolkning på rutenett 250m"
status: Gyldig

Skredhendelser
type: Concept
in scheme: Tegneregler
top concept of: Tegneregler
definition: Dokumentet gir en presentasjon over anbefalt kartografi ved bruk av datasettet Skredhendelser
description: Dokumentet gir en presentasjon over anbefalt kartografi ved bruk av datasettet Skredhendelser
status: Gyldig

Mareano bunnprøver linjer
type: Concept
in scheme: Tegneregler
top concept of: Tegneregler
definition: Dokumentet gir en presentasjon over anbefalt kartografi ved bruk av datasettet.
description: Dokumentet gir en presentasjon over anbefalt kartografi ved bruk av datasettet.
status: Gyldig

FKB-Tekst1000
type: Concept
in scheme: Tegneregler
top concept of: Tegneregler
definition: Dokumentet gir en presentasjon over anbefalt kartografi ved bruk av datasettet FKB-Tekst1000
description: Dokumentet gir en presentasjon over anbefalt kartografi ved bruk av datasettet FKB-Tekst1000
status: Gyldig

Befolkning på rutenett 5000m
type: Concept
in scheme: Tegneregler
top concept of: Tegneregler
definition: Dokumentet gir en presentasjon over anbefalt kartografi ved bruk av datasettet "Befolkning på rutenett 5000m"
description: Dokumentet gir en presentasjon over anbefalt kartografi ved bruk av datasettet "Befolkning på rutenett 5000m"
status: Gyldig

Dyrkingspotensial
type: Concept
in scheme: Tegneregler
top concept of: Tegneregler
definition: Dokumentet gir en presentasjon over anbefalt kartografi ved bruk av datasettet Dyrkingspotensial
description: Dokumentet gir en presentasjon over anbefalt kartografi ved bruk av datasettet Dyrkingspotensial
status: Gyldig

Naturtyper i Norge - Landskap
type: Concept
in scheme: Tegneregler
top concept of: Tegneregler
definition: Kartografi for datasettet
description: Kartografi for datasettet
status: Utkast

Menneskelig påvirkning - Tapte fiskeredskaper
type: Concept
in scheme: Tegneregler
top concept of: Tegneregler
definition: Placeholder
description: Placeholder
status: Sendt inn

Lufthavner Flyplasser
type: Concept
in scheme: Tegneregler
top concept of: Tegneregler
definition: Dokumentet gir en presentasjon over anbefalt kartografi ved bruk av datasettet.
description: Dokumentet gir en presentasjon over anbefalt kartografi ved bruk av datasettet.
status: Gyldig

Sårbare marine bunndyr – observasjonsdata
type: Concept
in scheme: Tegneregler
top concept of: Tegneregler
definition: Dokumentet gir en presentasjon over anbefalt kartografi ved bruk av datasettet.
description: Dokumentet gir en presentasjon over anbefalt kartografi ved bruk av datasettet.
status: Gyldig

Mektighet av holosene sedimenter i Skagerrak og Norskerenna
type: Concept
in scheme: Tegneregler
top concept of: Tegneregler
definition: Dokumentet gir en presentasjon over anbefalt kartografi ved bruk av datasett Mektighet av holosene sedimenter i Skagerrak og Norskerenna
description: Dokumentet gir en presentasjon over anbefalt kartografi ved bruk av datasett Mektighet av holosene sedimenter i Skagerrak og Norskerenna
status: Gyldig

Stedsnavn
type: Concept
in scheme: Tegneregler
top concept of: Tegneregler
definition: Dokumentet gir en presentasjon over anbefalt kartografi ved bruk av datasettet
description: Dokumentet gir en presentasjon over anbefalt kartografi ved bruk av datasettet
status: Gyldig

AR250
type: Concept
in scheme: Tegneregler
top concept of: Tegneregler
definition: Dokumentet gir en presentasjon over anbefalt kartografi ved bruk av datasettet AR250
description: Dokumentet gir en presentasjon over anbefalt kartografi ved bruk av datasettet AR250
status: Gyldig

Artsmangfold – Svampobservasjoner per video-transekt
type: Concept
in scheme: Tegneregler
top concept of: Tegneregler
definition: Dokumentet gir en presentasjon over anbefalt kartografi ved bruk av datasettet.
description: Dokumentet gir en presentasjon over anbefalt kartografi ved bruk av datasettet.
status: Gyldig

Kulturminner - Kulturmiljøer
type: Concept
in scheme: Tegneregler
top concept of: Tegneregler
definition: Dokumentet gir presentasjonsregler for datasettet Kulturminner - Kulturmiljøer
description: Dokumentet gir presentasjonsregler for datasettet Kulturminner - Kulturmiljøer
status: Gyldig

DMK (Digitalt Marslagskart)
type: Concept
in scheme: Tegneregler
top concept of: Tegneregler
definition: Dokumentet gir en presentasjon over anbefalt kartografi ved bruk av datasettet DMK (Digitalt Marslagskart)
description: Dokumentet gir en presentasjon over anbefalt kartografi ved bruk av datasettet DMK (Digitalt Marslagskart)
status: Gyldig

Undersjøiske fjell
type: Concept
in scheme: Tegneregler
top concept of: Tegneregler
definition: Dokumentet gir en presentasjon over anbefalt kartografi ved bruk av datasettet
description: Dokumentet gir en presentasjon over anbefalt kartografi ved bruk av datasettet
status: Gyldig

Naturvernområder - foreslåtte
type: Concept
in scheme: Tegneregler
top concept of: Tegneregler
definition: Dokumentet gir en presentasjon over anbefalt kartografi ved bruk av datasettet Naturvernområder - foreslåtte
description: Dokumentet gir en presentasjon over anbefalt kartografi ved bruk av datasettet Naturvernområder - foreslåtte
status: Gyldig

Villreinområder
type: Concept
in scheme: Tegneregler
top concept of: Tegneregler
status: Gyldig

Reindrift - Årstidsbeite - Høstbeite
type: Concept
in scheme: Tegneregler
top concept of: Tegneregler
definition: Dokumentet gir en presentasjon over anbefalt kartografi ved bruk av datasettet Reindrift - Årstidsbeite - Høstbeite
description: Dokumentet gir en presentasjon over anbefalt kartografi ved bruk av datasettet Reindrift - Årstidsbeite - Høstbeite
status: Gyldig

Spesifikasjon for skjermkartografi
type: Concept
in scheme: Tegneregler
top concept of: Tegneregler
definition: Spesifikasjonen for skjermkartografi er et hjelpemiddel til å oppnå en god skjermpresentasjon av kartdata fra Kartverket og Geovekst. Spesifikasjonen er tilpasset produktene N50-N5000 Kartdata og FKB-data. Den gir en grafisk fremstilling av kartobjektene vist i ulike målestokkintervaller. Kartografien er laget for generell bruk av kartdata. Ved bruk som kartgrunnlag for tematiske visninger må kartografien tilpasses formålet. Zip-fila inneholder versjon 2.2 av dokumentet, og tilhørende symbolfont for skjermkartografi.
description: Spesifikasjonen for skjermkartografi er et hjelpemiddel til å oppnå en god skjermpresentasjon av kartdata fra Kartverket og Geovekst. Spesifikasjonen er tilpasset produktene N50-N5000 Kartdata og FKB-data. Den gir en grafisk fremstilling av kartobjektene vist i ulike målestokkintervaller. Kartografien er laget for generell bruk av kartdata. Ved bruk som kartgrunnlag for tematiske visninger må kartografien tilpasses formålet. Zip-fila inneholder versjon 2.2 av dokumentet, og tilhørende symbolfont for skjermkartografi.
status: Gyldig

Matrikkelkart WMS
type: Concept
in scheme: Tegneregler
top concept of: Tegneregler
definition: Dokumentet gir en presentasjon over anbefalt kartografi ved bruk av datasettet.
description: Dokumentet gir en presentasjon over anbefalt kartografi ved bruk av datasettet.
status: Gyldig

FKB skjermkartografi
type: Concept
in scheme: Tegneregler
top concept of: Tegneregler
definition: Dokumentet gir en presentasjon over anbefalt kartografi for skjermpresentasjon av FKB-data
description: Dokumentet gir en presentasjon over anbefalt kartografi for skjermpresentasjon av FKB-data
status: Gyldig

Grus og pukk
type: Concept
in scheme: Tegneregler
top concept of: Tegneregler
definition: Dokumentet gir en presentasjon over anbefalt kartografi ved bruk av datasettet Grus Pukk
description: Dokumentet gir en presentasjon over anbefalt kartografi ved bruk av datasettet Grus Pukk
status: Gyldig

Aktsomhetsområder snø- og steinskred
type: Concept
in scheme: Tegneregler
top concept of: Tegneregler
definition: Dokumentet gir en presentasjon over anbefalt kartografi ved bruk av datasettet Aktsomhetsområder snø- og steinskred
description: Dokumentet gir en presentasjon over anbefalt kartografi ved bruk av datasettet Aktsomhetsområder snø- og steinskred
status: Tilbaketrukket

Kulturlandskap - utvalgte
type: Concept
in scheme: Tegneregler
top concept of: Tegneregler
definition: Dokumentet gir en presentasjon over anbefalt kartografi ved bruk av datasettet Kulturlandskap - utvalgte
description: Dokumentet gir en presentasjon over anbefalt kartografi ved bruk av datasettet Kulturlandskap - utvalgte
status: Gyldig

Kulturminner - Freda bygninger
type: Concept
in scheme: Tegneregler
top concept of: Tegneregler
definition: Dokumentet gir presentasjonsregler for datasettet Kulturminner - Freda bygninger
description: Dokumentet gir presentasjonsregler for datasettet Kulturminner - Freda bygninger
status: Gyldig

Naturtyper_HB19
type: Concept
in scheme: Tegneregler
top concept of: Tegneregler
definition: Dokumentet gir en presentasjon over anbefalt kartografi ved bruk av datasettet Naturtyper - DN-håndbok19
description: Dokumentet gir en presentasjon over anbefalt kartografi ved bruk av datasettet Naturtyper - DN-håndbok19
status: Utkast

Marine sedimentasjonsmiljø
type: Concept
in scheme: Tegneregler
top concept of: Tegneregler
definition: Dokumentet gir en presentasjon over anbefalt kartografi ved bruk av datasett Marine sedimentasjonsmiljø, regionalt og detaljert. Datasettene gir en oversikt over dominerende sedimentasjonsmiljø i det kartlagte området.
description: Dokumentet gir en presentasjon over anbefalt kartografi ved bruk av datasett Marine sedimentasjonsmiljø, regionalt og detaljert. Datasettene gir en oversikt over dominerende sedimentasjonsmiljø i det kartlagte området.
status: Gyldig

N20 Kartdata
type: Concept
in scheme: Tegneregler
top concept of: Tegneregler
definition: Dokumentet gir en presentasjon over anbefalt kartografi ved bruk av datasettet N20 Kartdata
description: Dokumentet gir en presentasjon over anbefalt kartografi ved bruk av datasettet N20 Kartdata
status: Gyldig

Reindrift - Reinbeitedistrikt
type: Concept
in scheme: Tegneregler
top concept of: Tegneregler
definition: Dokumentet gir en presentasjon over anbefalt kartografi ved bruk av datasettet Reindrift Reinbeitedistrikt.
description: Dokumentet gir en presentasjon over anbefalt kartografi ved bruk av datasettet Reindrift Reinbeitedistrikt.
status: Gyldig

Skjellsand - områder
type: Concept
in scheme: Tegneregler
top concept of: Tegneregler
definition: Dokumentet gir en presentasjon over anbefalt kartografi ved bruk av datasett "Skjellsand - områder"
description: Dokumentet gir en presentasjon over anbefalt kartografi ved bruk av datasett "Skjellsand - områder"
status: Gyldig

Nasjonalt register over luftfartshindre (NRL)
type: Concept
in scheme: Tegneregler
top concept of: Tegneregler
status: Gyldig

Setre i drift
type: Concept
in scheme: Tegneregler
top concept of: Tegneregler
definition: Dokumentet gir en presentasjon over anbefalt kartografi ved bruk av datasettet Setre i drift
description: Dokumentet gir en presentasjon over anbefalt kartografi ved bruk av datasettet Setre i drift
status: Utkast

Låssettingsplasser
type: Concept
in scheme: Tegneregler
top concept of: Tegneregler
definition: Presentasjonsregler for Fiskeridirektoratets datasettet Låssettingsplasser
description: Presentasjonsregler for Fiskeridirektoratets datasettet Låssettingsplasser
status: Gyldig

N2000 Kartdata
type: Concept
in scheme: Tegneregler
top concept of: Tegneregler
definition: Dokumentet gir en presentasjon over anbefalt kartografi ved bruk av datasettet N2000 Kartdata
description: Dokumentet gir en presentasjon over anbefalt kartografi ved bruk av datasettet N2000 Kartdata
status: Gyldig

Grunnvannsborehull
type: Concept
in scheme: Tegneregler
top concept of: Tegneregler
definition: Dokumentet gir presentasjonsregler for datasettet Grunnvannsborehull
description: Dokumentet gir presentasjonsregler for datasettet Grunnvannsborehull
status: Gyldig

Kulturminner - Brannsmitteområder
type: Concept
in scheme: Tegneregler
top concept of: Tegneregler
definition: Dokumentet gir presentasjonsregler for datasettet Kulturminner - Brannsmitteområder
description: Dokumentet gir presentasjonsregler for datasettet Kulturminner - Brannsmitteområder
status: Gyldig

FKB-Vann
type: Concept
in scheme: Tegneregler
top concept of: Tegneregler
definition: Dokumentet gir en presentasjon over anbefalt kartografi ved bruk av datasettet FKB-Vann
description: Dokumentet gir en presentasjon over anbefalt kartografi ved bruk av datasettet FKB-Vann
status: Gyldig

Modellert Havbunnsgeologi WMS
type: Concept
in scheme: Tegneregler
top concept of: Tegneregler
definition: Dokumentet gir en overordnet presentasjon av Modellert Havbunnsgeologi WMS.
description: Dokumentet gir en overordnet presentasjon av Modellert Havbunnsgeologi WMS.
status: Gyldig

Artsmangfold videoobserverte korallbunntyper
type: Concept
in scheme: Tegneregler
top concept of: Tegneregler
definition: Anbefalt kartografi for datasettet
description: Anbefalt kartografi for datasettet
status: Gyldig

Berggrunn
type: Concept
in scheme: Tegneregler
top concept of: Tegneregler
definition: Dokumentet gir en presentasjon over anbefalt kartografi for Berggrunn, symbolisert på hovedbergart
description: Dokumentet gir en presentasjon over anbefalt kartografi for Berggrunn, symbolisert på hovedbergart
status: Gyldig

Verdifulle kulturlandskap
type: Concept
in scheme: Tegneregler
top concept of: Tegneregler
status: Gyldig

Reindrift - Årstidsbeite - Høstvinterbeite
type: Concept
in scheme: Tegneregler
top concept of: Tegneregler
definition: Dokumnetet gir en beskrivelse av tegneregler for datasettet Reindrift - Årstidsbeite - Høstvinterbeite
description: Dokumnetet gir en beskrivelse av tegneregler for datasettet Reindrift - Årstidsbeite - Høstvinterbeite
status: Gyldig

Jordsmonn
type: Concept
in scheme: Tegneregler
top concept of: Tegneregler
definition: Dokumentet gir en presentasjon over anbefalt kartografi ved bruk av datasettet Jordsmonn
description: Dokumentet gir en presentasjon over anbefalt kartografi ved bruk av datasettet Jordsmonn
status: Gyldig

Generelle marine biotoper
type: Concept
in scheme: Tegneregler
top concept of: Tegneregler
definition: Dokumentet gir en presentasjon over anbefalt kartografi ved bruk av datasett Generelle marine biotoper modellert i 2022.
description: Dokumentet gir en presentasjon over anbefalt kartografi ved bruk av datasett Generelle marine biotoper modellert i 2022.
status: Gyldig

Kulturminner - Verneverdig tette trehusmiljøer
type: Concept
in scheme: Tegneregler
top concept of: Tegneregler
definition: Dokumentet gir presentasjonsregler for datasettet Kulturminner - Verneverdig tette trehusmiljøer
description: Dokumentet gir presentasjonsregler for datasettet Kulturminner - Verneverdig tette trehusmiljøer
status: Gyldig

Ankringsforhold
type: Concept
in scheme: Tegneregler
top concept of: Tegneregler
definition: Dokumentet gir en presentasjon over anbefalt kartografi ved bruk av datasettet Ankringsforhold
description: Dokumentet gir en presentasjon over anbefalt kartografi ved bruk av datasettet Ankringsforhold
status: Gyldig

Verneplan for vassdrag
type: Concept
in scheme: Tegneregler
top concept of: Tegneregler
definition: Dokumentet gir en presentasjon over anbefalt kartografi ved bruk av datasettet Verneplan for vassdrag
description: Dokumentet gir en presentasjon over anbefalt kartografi ved bruk av datasettet Verneplan for vassdrag
status: Gyldig

Gravbarhet
type: Concept
in scheme: Tegneregler
top concept of: Tegneregler
definition: Dokumentet gir en presentasjon over anbefalt kartografi ved bruk av datasettet Gravbarhet
description: Dokumentet gir en presentasjon over anbefalt kartografi ved bruk av datasettet Gravbarhet
status: Gyldig

Kulturminner - Lokaliteter, Enkeltminner og Sikringssoner
type: Concept
in scheme: Tegneregler
top concept of: Tegneregler
status: Gyldig

Biotoper i Barentshavet
type: Concept
in scheme: Tegneregler
top concept of: Tegneregler
definition: Dokumentet gir anbefalinger for kartografi ved bruk av datasettet Biotoper i Barentshavet
description: Dokumentet gir anbefalinger for kartografi ved bruk av datasettet Biotoper i Barentshavet
status: Gyldig

Statlig sikra friluftsområder
type: Concept
in scheme: Tegneregler
top concept of: Tegneregler
status: Gyldig

Støysoner for Bane NORs jernbanenett
type: Concept
in scheme: Tegneregler
top concept of: Tegneregler
definition: Dokumentet gir en presentasjon over anbefalt kartografi ved bruk av datasettet
description: Dokumentet gir en presentasjon over anbefalt kartografi ved bruk av datasettet
status: Gyldig

FKB kvalitet WMS
type: Concept
in scheme: Tegneregler
top concept of: Tegneregler
definition: Dokumentet gir en presentasjon over anbefalt kartografi ved bruk av FKB kvalitet
description: Dokumentet gir en presentasjon over anbefalt kartografi ved bruk av FKB kvalitet
status: Tilbaketrukket

Mareano referansestasjoner
type: Concept
in scheme: Tegneregler
top concept of: Tegneregler
definition: Dokumentet gir en presentasjon over anbefalt kartografi ved bruk av datasettet.
description: Dokumentet gir en presentasjon over anbefalt kartografi ved bruk av datasettet.
status: Gyldig

Administrative enheter Norge
type: Concept
in scheme: Tegneregler
top concept of: Tegneregler
definition: Dokumentet gir en presentasjon over anbefalt kartografi ved bruk av datasettet Administrative enheter Norge x
description: Dokumentet gir en presentasjon over anbefalt kartografi ved bruk av datasettet Administrative enheter Norge x
status: Gyldig

Reindrift - Trekklei
type: Concept
in scheme: Tegneregler
top concept of: Tegneregler
definition: Dokumentet gir en presentasjon over anbefalt kartografi ved bruk av datasettet Reindrift - Trekklei
description: Dokumentet gir en presentasjon over anbefalt kartografi ved bruk av datasettet Reindrift - Trekklei
status: Gyldig

Matrikkelen - Bygningspunkt
type: Concept
in scheme: Tegneregler
top concept of: Tegneregler
status: Gyldig

Vindressurser
type: Concept
in scheme: Tegneregler
top concept of: Tegneregler
definition: Dokumentet gir en presentasjon over anbefalt kartografi ved bruk av datasettet Vindressurser
description: Dokumentet gir en presentasjon over anbefalt kartografi ved bruk av datasettet Vindressurser
status: Gyldig

SAT-SKOG
type: Concept
in scheme: Tegneregler
top concept of: Tegneregler
definition: Dokumentet gir en presentasjon over anbefalt kartografi ved bruk av datasettet SAT-SKOG
description: Dokumentet gir en presentasjon over anbefalt kartografi ved bruk av datasettet SAT-SKOG
status: Gyldig

Trålspor
type: Concept
in scheme: Tegneregler
top concept of: Tegneregler
definition: Dokumentet gir en presentasjon over anbefalt kartografi ved bruk av datasettet.
description: Dokumentet gir en presentasjon over anbefalt kartografi ved bruk av datasettet.
status: Gyldig

FKB-Bane
type: Concept
in scheme: Tegneregler
top concept of: Tegneregler
definition: Dokumentet gir en presentasjon over anbefalt kartografi ved bruk av datasettet "FKB-Bane"
description: Dokumentet gir en presentasjon over anbefalt kartografi ved bruk av datasettet "FKB-Bane"
status: Gyldig

Trafikkulykker
type: Concept
in scheme: Tegneregler
top concept of: Tegneregler
definition: Dokumentet gir en presentasjon over anbefalt kartografi ved bruk av datasettet Trafikkulykker.
description: Dokumentet gir en presentasjon over anbefalt kartografi ved bruk av datasettet Trafikkulykker.
status: Gyldig

Mineralressurser; industrimineral, naturstein og metaller
type: Concept
in scheme: Tegneregler
top concept of: Tegneregler
definition: Dokumentet gir en presentasjon over anbefalt kartografi ved bruk av datasettet Mineralressurser
description: Dokumentet gir en presentasjon over anbefalt kartografi ved bruk av datasettet Mineralressurser
status: Gyldig

Reindrift - Avtaleområde
type: Concept
in scheme: Tegneregler
top concept of: Tegneregler
definition: Dokumentet gir en presentasjon over anbefalt kartografi ved bruk av datasettet Reindrift Avtaleområde.
description: Dokumentet gir en presentasjon over anbefalt kartografi ved bruk av datasettet Reindrift Avtaleområde.
status: Gyldig

FKB Dataalder WMS
type: Concept
in scheme: Tegneregler
top concept of: Tegneregler
status: Gyldig

Gassoppkommer
type: Concept
in scheme: Tegneregler
top concept of: Tegneregler
definition: Dokumentet gir en presentasjon over anbefalt kartografi ved bruk av datasettet Gassoppkommer.
description: Dokumentet gir en presentasjon over anbefalt kartografi ved bruk av datasettet Gassoppkommer.
status: Gyldig

FKB-Ledning
type: Concept
in scheme: Tegneregler
top concept of: Tegneregler
definition: Dokumentet gir en presentasjon over anbefalt kartografi ved bruk av datasettet FKB-Ledning
description: Dokumentet gir en presentasjon over anbefalt kartografi ved bruk av datasettet FKB-Ledning
status: Gyldig

Sårbare marine biotoper - modellert utbredelse Glassvampsamfunn
type: Concept
in scheme: Tegneregler
top concept of: Tegneregler
definition: Dokumentet gir en presentasjon over anbefalt kartografi ved bruk av datasettet.
description: Dokumentet gir en presentasjon over anbefalt kartografi ved bruk av datasettet.
status: Gyldig

Sedimentasjonsrater i havbunnsedimenter i Nordsjøen og Skagerrak
type: Concept
in scheme: Tegneregler
top concept of: Tegneregler
definition: Dokumentet gir en overordnet presentasjon av produktet "Sedimentasjonsrater i havbunnsedimenter i Nordsjøen og Skagerrak".
description: Dokumentet gir en overordnet presentasjon av produktet "Sedimentasjonsrater i havbunnsedimenter i Nordsjøen og Skagerrak".
status: Gyldig

Flomsoner
type: Concept
in scheme: Tegneregler
top concept of: Tegneregler
definition: Dokumentet gir en presentasjon over anbefalt kartografi ved bruk av datasettet flomsoner
description: Dokumentet gir en presentasjon over anbefalt kartografi ved bruk av datasettet flomsoner
status: Gyldig

Nasjonale laksefjorder
type: Concept
in scheme: Tegneregler
top concept of: Tegneregler
definition: Dokumentet gir en presentasjon over anbefalt kartografi ved bruk av datasettet.
description: Dokumentet gir en presentasjon over anbefalt kartografi ved bruk av datasettet.
status: Gyldig

Farled
type: Concept
in scheme: Tegneregler
top concept of: Tegneregler
definition: Dokumentet gir en presentasjon over anbefalt kartografi ved bruk av produktet Farled.
description: Dokumentet gir en presentasjon over anbefalt kartografi ved bruk av produktet Farled.
status: Gyldig

Barnetråkk - fullstendig
type: Concept
in scheme: Tegneregler
top concept of: Tegneregler
definition: Dokumentet gir en presentasjon over anbefalt kartografi ved bruk av datasettet "Barnetråkk".
description: Dokumentet gir en presentasjon over anbefalt kartografi ved bruk av datasettet "Barnetråkk".
status: Gyldig

Befolkning på rutenett 1000m
type: Concept
in scheme: Tegneregler
top concept of: Tegneregler
definition: Dokumentet gir en presentasjon over anbefalt kartografi ved bruk av datasettet Befolkning på rutenett 1000m
description: Dokumentet gir en presentasjon over anbefalt kartografi ved bruk av datasettet Befolkning på rutenett 1000m
status: Gyldig

FKB-Lufthavn
type: Concept
in scheme: Tegneregler
top concept of: Tegneregler
definition: Dokumentet gir en presentasjon over anbefalt kartografi ved bruk av datasettet FKB-Lufthavn
description: Dokumentet gir en presentasjon over anbefalt kartografi ved bruk av datasettet FKB-Lufthavn
status: Gyldig

Hornkoraller
type: Concept
in scheme: Tegneregler
top concept of: Tegneregler
definition: Dokumentet gir en presentasjon over anbefalt kartografi ved bruk av datasettet.
description: Dokumentet gir en presentasjon over anbefalt kartografi ved bruk av datasettet.
status: Gyldig

Sentrumssoner
type: Concept
in scheme: Tegneregler
top concept of: Tegneregler
status: Gyldig

N5 Presentasjonsdata
type: Concept
in scheme: Tegneregler
top concept of: Tegneregler
definition: Dokumentet gir en presentasjon over anbefalt kartografi ved bruk av datasettet.
description: Dokumentet gir en presentasjon over anbefalt kartografi ved bruk av datasettet.
status: Gyldig

Sårbare marine biotoper – modellert utbredelse Svampspikelbunn
type: Concept
in scheme: Tegneregler
top concept of: Tegneregler
definition: Dokumentet gir en presentasjon over anbefalt kartografi ved bruk av datasettet.
description: Dokumentet gir en presentasjon over anbefalt kartografi ved bruk av datasettet.
status: Gyldig

Vindkraftverk
type: Concept
in scheme: Tegneregler
top concept of: Tegneregler
definition: Tegneregler for datasettet vindkraftverk
description: Tegneregler for datasettet vindkraftverk
status: Gyldig

Aktsomhetsområder snøskred
type: Concept
in scheme: Tegneregler
top concept of: Tegneregler
definition: Dette datasettet er erstattet av "Aktsomhetskart for snøskred" med produktark: https://register.geonorge.no/tegneregler/aktsomhetskart-for-snøskred. Dokumentet gir en presentasjon over anbefalt kartografi ved bruk av datasettet Aktsomhetsområder snøskred
description: Dette datasettet er erstattet av "Aktsomhetskart for snøskred" med produktark: https://register.geonorge.no/tegneregler/aktsomhetskart-for-snøskred. Dokumentet gir en presentasjon over anbefalt kartografi ved bruk av datasettet Aktsomhetsområder snøskred
status: Tilbaketrukket

Mareanoprøver – Artsmangfold, individer og biomasse
type: Concept
in scheme: Tegneregler
top concept of: Tegneregler
definition: Dokumentet gir en presentasjon over anbefalt kartografi ved bruk av datasettet.
description: Dokumentet gir en presentasjon over anbefalt kartografi ved bruk av datasettet.
status: Gyldig

Byggeforbudssoner kraftledninger
type: Concept
in scheme: Tegneregler
top concept of: Tegneregler
definition: Tegneregler for datasettet Byggeforbudssoner kraftledninger som inneholder byggeforbudssoner for Statnetts kraftledninger. Dette er arealer rundt kraftledninger som er klausulert i medhold av konsesjon etter energiloven og ekspropriasjon etter oreigningsloven eller minnelig avtale med berørte grunneiere.
description: Tegneregler for datasettet Byggeforbudssoner kraftledninger som inneholder byggeforbudssoner for Statnetts kraftledninger. Dette er arealer rundt kraftledninger som er klausulert i medhold av konsesjon etter energiloven og ekspropriasjon etter oreigningsloven eller minnelig avtale med berørte grunneiere.
status: Gyldig

Dybdedata i Oslofjorden - terrengmodell - 1m-grid
type: Concept
in scheme: Tegneregler
top concept of: Tegneregler
definition: Dokumentet gir anbefalinger for kartografi ved bruk av datasettet Dybdedata i Oslofjorden - terrengmodell - 1m-grid
description: Dokumentet gir anbefalinger for kartografi ved bruk av datasettet Dybdedata i Oslofjorden - terrengmodell - 1m-grid
status: Gyldig

Korallrev forbudsområder
type: Concept
in scheme: Tegneregler
top concept of: Tegneregler
definition: Dokumentet gir en presentasjon over anbefalt kartografi ved bruk av datasettet Korallrev forbudsområder
description: Dokumentet gir en presentasjon over anbefalt kartografi ved bruk av datasettet Korallrev forbudsområder
status: Gyldig

Sjøkart - Maritim infrastruktur
type: Concept
in scheme: Tegneregler
top concept of: Tegneregler
definition: Presentasjonsregler for datasettet Sjøkart - Maritim infrastruktur
description: Presentasjonsregler for datasettet Sjøkart - Maritim infrastruktur
status: Gyldig

Tungmetaller og andre uorganiske miljøelementer i marine sedimenter
type: Concept
in scheme: Tegneregler
top concept of: Tegneregler
definition: Dokumentet gir en presentasjon over anbefalt kartografi ved bruk av datasettet Tungmetaller og andre uorganiske miljøelementer i marine sedimenter
description: Dokumentet gir en presentasjon over anbefalt kartografi ved bruk av datasettet Tungmetaller og andre uorganiske miljøelementer i marine sedimenter
status: Gyldig

N5 raster
type: Concept
in scheme: Tegneregler
top concept of: Tegneregler
definition: Informasjon lik kartene i Økonomisk kartverk. Symboler, linjer og tekst med samme form som på kartene. Informasjonen forefinnes som et rasterlag pr. kartblad.Datamengde ca. 1 Mb pr. kartblad i TIFFformat i s/h.Datamengde ca. 8 Mb pr. kartblad i PNGformat i farge.
description: Informasjon lik kartene i Økonomisk kartverk. Symboler, linjer og tekst med samme form som på kartene. Informasjonen forefinnes som et rasterlag pr. kartblad.Datamengde ca. 1 Mb pr. kartblad i TIFFformat i s/h.Datamengde ca. 8 Mb pr. kartblad i PNGformat i farge.
status: Gyldig

Hensynssoner kraftledninger
type: Concept
in scheme: Tegneregler
top concept of: Tegneregler
definition: Tegneregler for datasettet Hensynssoner kraftledninger som inneholder byggeforbudssoner for Statnetts kraftledninger. Dette er arealer rundt kraftledninger som er klausulert i medhold av konsesjon etter energiloven og ekspropriasjon etter oreigningsloven eller minnelig avtale med berørte grunneiere.
description: Tegneregler for datasettet Hensynssoner kraftledninger som inneholder byggeforbudssoner for Statnetts kraftledninger. Dette er arealer rundt kraftledninger som er klausulert i medhold av konsesjon etter energiloven og ekspropriasjon etter oreigningsloven eller minnelig avtale med berørte grunneiere.
status: Gyldig

Vernskog
type: Concept
in scheme: Tegneregler
top concept of: Tegneregler
definition: Dokumentet gir en presentasjon over anbefalt kartografi ved bruk av datasettet Vernskog
description: Dokumentet gir en presentasjon over anbefalt kartografi ved bruk av datasettet Vernskog
status: Gyldig

Tilgjengelighet - tettsted
type: Concept
in scheme: Tegneregler
top concept of: Tegneregler
definition: Dokumentet gir en presentasjon over anbefalt kartografi ved bruk av datasettet Tilgjengelighet - tettsted
description: Dokumentet gir en presentasjon over anbefalt kartografi ved bruk av datasettet Tilgjengelighet - tettsted
status: Gyldig

Elvenett
type: Concept
in scheme: Tegneregler
top concept of: Tegneregler
definition: Dokumentet gir en presentasjon over anbefalt kartografi ved bruk av datasettet elvenett
description: Dokumentet gir en presentasjon over anbefalt kartografi ved bruk av datasettet elvenett
status: Gyldig

Landformer
type: Concept
in scheme: Tegneregler
top concept of: Tegneregler
definition: Dokumentet gir en presentasjon av anbefalt kartografi ved bruk av datasettet Landformer.
description: Dokumentet gir en presentasjon av anbefalt kartografi ved bruk av datasettet Landformer.
status: Gyldig

N1000 Kartdata
type: Concept
in scheme: Tegneregler
top concept of: Tegneregler
definition: Dokumentet gir en presentasjon over anbefalt kartografi ved bruk av datasettet N1000 Kartdata
description: Dokumentet gir en presentasjon over anbefalt kartografi ved bruk av datasettet N1000 Kartdata
status: Gyldig

Havnedata
type: Concept
in scheme: Tegneregler
top concept of: Tegneregler
definition: Havnedata
description: Havnedata
status: Gyldig

Digitale ortofoto
type: Concept
in scheme: Tegneregler
top concept of: Tegneregler
definition: Dokumentet gir en presentasjon over anbefalt kartografi ved bruk av datasettet Digitale ortofoto.
description: Dokumentet gir en presentasjon over anbefalt kartografi ved bruk av datasettet Digitale ortofoto.
status: Gyldig

Foreslåtte naturvernområder
type: Concept
in scheme: Tegneregler
top concept of: Tegneregler
status: Gyldig

Norges maritime grenser
type: Concept
in scheme: Tegneregler
top concept of: Tegneregler
definition: Dokumentet gir en presentasjon over anbefalt kartografi ved bruk av datasettet "Norges maritime grenser"
description: Dokumentet gir en presentasjon over anbefalt kartografi ved bruk av datasettet "Norges maritime grenser"
status: Gyldig

Arealbruk
type: Concept
in scheme: Tegneregler
top concept of: Tegneregler
definition: Dokumentet gir en presentasjon over anbefalt kartografi ved bruk av datasettet Arealbruk
description: Dokumentet gir en presentasjon over anbefalt kartografi ved bruk av datasettet Arealbruk
status: Gyldig

Anlegg med farlig stoff
type: Concept
in scheme: Tegneregler
top concept of: Tegneregler
definition: Dokumentet gir en presentasjon over anbefalt kartografi ved bruk av datasettet Anlegg med farlig stoff.
description: Dokumentet gir en presentasjon over anbefalt kartografi ved bruk av datasettet Anlegg med farlig stoff.
status: Gyldig

Aktsomhetskart for kvikkleireskred
type: Concept
in scheme: Tegneregler
top concept of: Tegneregler
definition: Dokumentet gir en overordnet presentasjon av datasettet Aktsomhetskart for kvikkleireskred
description: Dokumentet gir en overordnet presentasjon av datasettet Aktsomhetskart for kvikkleireskred
status: Gyldig

Nødhavner
type: Concept
in scheme: Tegneregler
top concept of: Tegneregler
definition: Dokumentet gir en presentasjon over anbefalt kartografi ved bruk av datasettet Nødhavner
description: Dokumentet gir en presentasjon over anbefalt kartografi ved bruk av datasettet Nødhavner
status: Utkast

Navigasjonsinstallasjoner
type: Concept
in scheme: Tegneregler
top concept of: Tegneregler
definition: Dokumentet gir en presentasjon over anbefalt kartografi ved bruk av datasettet Navigasjonsinstallasjoner.
description: Dokumentet gir en presentasjon over anbefalt kartografi ved bruk av datasettet Navigasjonsinstallasjoner.
status: Utkast

FKB-PblTiltak
type: Concept
in scheme: Tegneregler
top concept of: Tegneregler
definition: Dokumentet gir en presentasjon over anbefalt kartografi ved bruk av datasettet FKB-PblTiltak
description: Dokumentet gir en presentasjon over anbefalt kartografi ved bruk av datasettet FKB-PblTiltak
status: Gyldig

Jordkvalitet
type: Concept
in scheme: Tegneregler
top concept of: Tegneregler
definition: Dokumentet gir en presentasjon over anbefalt kartografi ved bruk av datasettet Jordkvalitet
description: Dokumentet gir en presentasjon over anbefalt kartografi ved bruk av datasettet Jordkvalitet
status: Gyldig

Mareano - videostasjoner
type: Concept
in scheme: Tegneregler
top concept of: Tegneregler
definition: Dokumentet gir en presentasjon over anbefalt kartografi ved bruk av datasettet.
description: Dokumentet gir en presentasjon over anbefalt kartografi ved bruk av datasettet.
status: Gyldig

Reindrift - Konvensjonsområde
type: Concept
in scheme: Tegneregler
top concept of: Tegneregler
definition: Dokumentet gir en presentasjon over anbefalt kartografi ved bruk av datasettet Reindrift - Konvensjonsområde.
description: Dokumentet gir en presentasjon over anbefalt kartografi ved bruk av datasettet Reindrift - Konvensjonsområde.
status: Gyldig

Støykartlegging veg etter T-1442
type: Concept
in scheme: Tegneregler
top concept of: Tegneregler
definition: Dokumentet gir en presentasjon over anbefalt kartografi ved bruk av datasettet.
description: Dokumentet gir en presentasjon over anbefalt kartografi ved bruk av datasettet.
status: Gyldig

AR50
type: Concept
in scheme: Tegneregler
top concept of: Tegneregler
definition: Dokumentet gir en presentasjon over anbefalt kartografi ved bruk av datasettet "AR50 - Arealtyper"
description: Dokumentet gir en presentasjon over anbefalt kartografi ved bruk av datasettet "AR50 - Arealtyper"
status: Gyldig

Mareano bunnprøver punkt
type: Concept
in scheme: Tegneregler
top concept of: Tegneregler
definition: Dokumentet gir en presentasjon over anbefalt kartografi ved bruk av datasettet.
description: Dokumentet gir en presentasjon over anbefalt kartografi ved bruk av datasettet.
status: Gyldig

Forurenset grunn - v2
type: Concept
in scheme: Tegneregler
top concept of: Tegneregler
definition: Dokumentet gir en presentasjon over anbefalt kartografi ved bruk av datasettet Forurenset grunn
description: Dokumentet gir en presentasjon over anbefalt kartografi ved bruk av datasettet Forurenset grunn
status: Gyldig

Reindrift - Samebyavtale
type: Concept
in scheme: Tegneregler
top concept of: Tegneregler
status: Gyldig

FKB-Bygningsmessige anlegg
type: Concept
in scheme: Tegneregler
top concept of: Tegneregler
definition: Dokumentet gir en presentasjon over anbefalt kartografi ved bruk av datasettet FKB-Bygningsmessige anlegg
description: Dokumentet gir en presentasjon over anbefalt kartografi ved bruk av datasettet FKB-Bygningsmessige anlegg
status: Gyldig

Ankringsområder
type: Concept
in scheme: Tegneregler
top concept of: Tegneregler
definition: Dokumentet gir en presentasjon over anbefalt kartografi ved bruk av datasettet Ankringsområder
description: Dokumentet gir en presentasjon over anbefalt kartografi ved bruk av datasettet Ankringsområder
status: Gyldig

Reindrift - Flyttlei
type: Concept
in scheme: Tegneregler
top concept of: Tegneregler
definition: Dokumentet gir en presentasjon over anbefalt kartografi ved bruk av datasettet Reindrift Flyttlei.
description: Dokumentet gir en presentasjon over anbefalt kartografi ved bruk av datasettet Reindrift Flyttlei.
status: Gyldig

Marine landformer
type: Concept
in scheme: Tegneregler
top concept of: Tegneregler
definition: Dokumentet gir en presentasjon over anbefalt kartografi ved bruk av datasettet Marine landformer
description: Dokumentet gir en presentasjon over anbefalt kartografi ved bruk av datasettet Marine landformer
status: Gyldig

FKB-Naturinfo
type: Concept
in scheme: Tegneregler
top concept of: Tegneregler
definition: Dokumentet gir en presentasjon over anbefalt kartografi ved bruk av datasettet FKB-Naturinfo
description: Dokumentet gir en presentasjon over anbefalt kartografi ved bruk av datasettet FKB-Naturinfo
status: Gyldig

Mareano bunnprøvestasjoner
type: Concept
in scheme: Tegneregler
top concept of: Tegneregler
definition: Dokumentet gir en presentasjon over anbefalt kartografi ved bruk av datasettet.
description: Dokumentet gir en presentasjon over anbefalt kartografi ved bruk av datasettet.
status: Gyldig

Reindrift - Årstidsbeite - Sommerbeite
type: Concept
in scheme: Tegneregler
top concept of: Tegneregler
definition: Dokumentet gir en beskrivelse av tegneregler for datasettet Reindrift - Årstidsbeite - Sommerbeite
description: Dokumentet gir en beskrivelse av tegneregler for datasettet Reindrift - Årstidsbeite - Sommerbeite
status: Gyldig

Aktsomhetskart for snøskred
type: Concept
in scheme: Tegneregler
top concept of: Tegneregler
definition: Dokumentet gir en presentasjon over anbefalte tegneregler ved bruk av datasettet Aktsomhetskart for snøskred
description: Dokumentet gir en presentasjon over anbefalte tegneregler ved bruk av datasettet Aktsomhetskart for snøskred
status: Gyldig

Reindrift - Reindriftsanlegg
type: Concept
in scheme: Tegneregler
top concept of: Tegneregler
definition: Dokumentet gir en presentasjon over anbefalt kartografi ved bruk av datasettet Reindriftsanlegg
description: Dokumentet gir en presentasjon over anbefalt kartografi ved bruk av datasettet Reindriftsanlegg
status: Gyldig

Reindrift - Årstidsbeite - Vinterbeite
type: Concept
in scheme: Tegneregler
top concept of: Tegneregler
definition: Dokumentet gir en presentasjon over anbefalt kartografi ved bruk av datasettet Reindrift – Årstidsbeite - Vinterbeite
description: Dokumentet gir en presentasjon over anbefalt kartografi ved bruk av datasettet Reindrift – Årstidsbeite - Vinterbeite
status: Gyldig

Mulighet for marin leire
type: Concept
in scheme: Tegneregler
top concept of: Tegneregler
definition: Mulighet for marin leire er basert på løsmassekart i målestokk 1:50.000 eller bedre og datasett for marin grense. Løsmassetyper under marin grense er klassifisert etter muligheten for å finne marin leire og kan grovt sett inndeles i seks klasser.
description: Mulighet for marin leire er basert på løsmassekart i målestokk 1:50.000 eller bedre og datasett for marin grense. Løsmassetyper under marin grense er klassifisert etter muligheten for å finne marin leire og kan grovt sett inndeles i seks klasser.
status: Gyldig

Støysoner for Forsvarets skyte- og øvingsfelt
type: Concept
in scheme: Tegneregler
top concept of: Tegneregler
definition: Dokumentet gir en presentasjon over anbefalt kartografi ved bruk av datasettet Støysoner for Forsvarets skyte- og øvingsfelt
description: Dokumentet gir en presentasjon over anbefalt kartografi ved bruk av datasettet Støysoner for Forsvarets skyte- og øvingsfelt
status: Gyldig

Militære forbudsområder innen sjøforsvaret
type: Concept
in scheme: Tegneregler
top concept of: Tegneregler
definition: Dokumentet gir en presentasjon over anbefalt kartografi ved bruk av datasettet.
description: Dokumentet gir en presentasjon over anbefalt kartografi ved bruk av datasettet.
status: Gyldig

FKB-TraktorvegSti
type: Concept
in scheme: Tegneregler
top concept of: Tegneregler
definition: Dokumentet gir en presentasjon over anbefalt kartografi ved bruk av datasettet FKB-TraktorvegSti
description: Dokumentet gir en presentasjon over anbefalt kartografi ved bruk av datasettet FKB-TraktorvegSti
status: Gyldig

Reindrift - Ekspropriasjonsområde
type: Concept
in scheme: Tegneregler
top concept of: Tegneregler
definition: Dokumentet gir en presentasjon over anbefalt kartografi ved bruk av datasettet Reindrift - Ekspropriasjonsområde.
description: Dokumentet gir en presentasjon over anbefalt kartografi ved bruk av datasettet Reindrift - Ekspropriasjonsområde.
status: Gyldig

ISPSHavneanlegg
type: Concept
in scheme: Tegneregler
top concept of: Tegneregler
definition: Dokumentet gir en presentasjon over anbefalt kartografi ved bruk av datasettet ISPSHavneanlegg
description: Dokumentet gir en presentasjon over anbefalt kartografi ved bruk av datasettet ISPSHavneanlegg
status: Gyldig

N5000 Kartdata
type: Concept
in scheme: Tegneregler
top concept of: Tegneregler
definition: Dokumentet gir en presentasjon over anbefalt kartografi ved bruk av datasettet N5000 Kartdata
description: Dokumentet gir en presentasjon over anbefalt kartografi ved bruk av datasettet N5000 Kartdata
status: Gyldig

Sårbare marine biotoper – modellert utbredelse Svampsamfunn
type: Concept
in scheme: Tegneregler
top concept of: Tegneregler
definition: Dokumentet gir en presentasjon over anbefalt kartografi ved bruk av datasettet.
description: Dokumentet gir en presentasjon over anbefalt kartografi ved bruk av datasettet.
status: Gyldig

Matrikkelen - Adresse
type: Concept
in scheme: Tegneregler
top concept of: Tegneregler
status: Gyldig

Dyrkbar jord
type: Concept
in scheme: Tegneregler
top concept of: Tegneregler
definition: Dokumentet gir en presentasjon over anbefalt kartografi ved bruk av datasettet "Dyrkbar jord"
description: Dokumentet gir en presentasjon over anbefalt kartografi ved bruk av datasettet "Dyrkbar jord"
status: Gyldig

Flom aktsomhetsområder
type: Concept
in scheme: Tegneregler
top concept of: Tegneregler
definition: Tegneregler for datasettet flom aktsomhetsområder
description: Tegneregler for datasettet flom aktsomhetsområder
status: Gyldig

Markagrensen
type: Concept
in scheme: Tegneregler
top concept of: Tegneregler
definition: Dokumentet gir en presentasjon over anbefalt kartografi ved bruk av datasettet Markagrensen
description: Dokumentet gir en presentasjon over anbefalt kartografi ved bruk av datasettet Markagrensen
status: Gyldig

FKB-Bygning
type: Concept
in scheme: Tegneregler
top concept of: Tegneregler
definition: Dokumentet gir en presentasjon over anbefalt kartografi ved bruk av datasettet FKB-Bygning
description: Dokumentet gir en presentasjon over anbefalt kartografi ved bruk av datasettet FKB-Bygning
status: Gyldig

Mikroplast i marine sedimenter
type: Concept
in scheme: Tegneregler
top concept of: Tegneregler
definition: Dokumentet gir en presentasjon over anbefalt kartografi ved bruk av datasett Mikroplast i marine sedimenter.
description: Dokumentet gir en presentasjon over anbefalt kartografi ved bruk av datasett Mikroplast i marine sedimenter.
status: Gyldig

Kulturminner - SEFRAK
type: Concept
in scheme: Tegneregler
top concept of: Tegneregler
definition: Dokumentet gir presentasjonsregler for datasettet Kulturminner - SEFRAK
description: Dokumentet gir presentasjonsregler for datasettet Kulturminner - SEFRAK
status: Gyldig

Seismiske linjer, 2D
type: Concept
in scheme: Tegneregler
top concept of: Tegneregler
definition: Dokumentet gir en presentasjon over anbefalt kartografi ved bruk av datasett Seismiske linjer, 2D.
description: Dokumentet gir en presentasjon over anbefalt kartografi ved bruk av datasett Seismiske linjer, 2D.
status: Gyldig

Bergrettigheter
type: Concept
in scheme: Tegneregler
top concept of: Tegneregler
definition: Dokumentet gir en presentasjon over anbefalt kartografi ved bruk av datasettet "Bergrettigheter"
description: Dokumentet gir en presentasjon over anbefalt kartografi ved bruk av datasettet "Bergrettigheter"
status: Gyldig

Forsvarets skyte- øvingsfelt land
type: Concept
in scheme: Tegneregler
top concept of: Tegneregler
definition: Dokumentet gir en presentasjon over anbefalt kartografi ved bruk av datasettet Forsvarets skyte- øvingsfelt
description: Dokumentet gir en presentasjon over anbefalt kartografi ved bruk av datasettet Forsvarets skyte- øvingsfelt
status: Gyldig

Bunnsedimenter (dannelse)
type: Concept
in scheme: Tegneregler
top concept of: Tegneregler
definition: Dokumentet gir en presentasjon over anbefalt kartografi ved bruk av datasett Bunnsedimenter (dannelse) - oversikt, regionalt og detaljert. Viser bunnsedimenter i havbunnens øvre del, klassifisert etter jordartstype.
description: Dokumentet gir en presentasjon over anbefalt kartografi ved bruk av datasett Bunnsedimenter (dannelse) - oversikt, regionalt og detaljert. Viser bunnsedimenter i havbunnens øvre del, klassifisert etter jordartstype.
status: Gyldig

Tilgjengelighet - friluft
type: Concept
in scheme: Tegneregler
top concept of: Tegneregler
definition: Dokumentet gir en presentasjon over anbefalt kartografi ved bruk av datasettet Tilgjengelighet - friluft
description: Dokumentet gir en presentasjon over anbefalt kartografi ved bruk av datasettet Tilgjengelighet - friluft
status: Gyldig

Storulykkeanlegg
type: Concept
in scheme: Tegneregler
top concept of: Tegneregler
definition: Dokumentet gir en presentasjon over anbefalt kartografi ved bruk av datasettet Storulykkeanlegg
description: Dokumentet gir en presentasjon over anbefalt kartografi ved bruk av datasettet Storulykkeanlegg
status: Gyldig

AR5 forvaltning
type: Concept
in scheme: Tegneregler
top concept of: Tegneregler
definition: Dokumentet gir en presentasjon over anbefalt kartografi ved bruk av datasettet AR5 forvaltning
description: Dokumentet gir en presentasjon over anbefalt kartografi ved bruk av datasettet AR5 forvaltning
status: Gyldig

Matrikkelen - Eiendomskart Teig
type: Concept
in scheme: Tegneregler
top concept of: Tegneregler
status: Gyldig

Beitebruk
type: Concept
in scheme: Tegneregler
top concept of: Tegneregler
definition: Dokumentet gir en presentasjon over anbefalt kartografi ved bruk av datasettet Beitebruk
description: Dokumentet gir en presentasjon over anbefalt kartografi ved bruk av datasettet Beitebruk
status: Gyldig

Bunnsedimenter (kornstørrelse)
type: Concept
in scheme: Tegneregler
top concept of: Tegneregler
definition: Dokumentet gir en presentasjon over anbefalt kartografi ved bruk av datasett Bunnsedimenter (kornstørrelse). Viser kornstørrelsessammensetning og innhold av ulike kornfraksjoner i sjøbunnssedimentenes øvre del.
description: Dokumentet gir en presentasjon over anbefalt kartografi ved bruk av datasett Bunnsedimenter (kornstørrelse). Viser kornstørrelsessammensetning og innhold av ulike kornfraksjoner i sjøbunnssedimentenes øvre del.
status: Gyldig

Kulturminner - Sikringssoner
type: Concept
in scheme: Tegneregler
top concept of: Tegneregler
definition: Dokumentet gir presentasjonsregler for datasettet Kulturminner - Sikringssoner
description: Dokumentet gir presentasjonsregler for datasettet Kulturminner - Sikringssoner
status: Gyldig

N20 Bygning
type: Concept
in scheme: Tegneregler
top concept of: Tegneregler
definition: Dokumentet gir en presentasjon over anbefalt kartografi ved bruk av datasettet N20 Bygning
description: Dokumentet gir en presentasjon over anbefalt kartografi ved bruk av datasettet N20 Bygning
status: Gyldig

Fiskeplasser - redskap
type: Concept
in scheme: Tegneregler
top concept of: Tegneregler
definition: Dokumentet gir en presentasjon av anbefalt kartografi ved bruk av datasettet.
description: Dokumentet gir en presentasjon av anbefalt kartografi ved bruk av datasettet.
status: Gyldig

Reindrift – Årstidsbeite - Vårbeite
type: Concept
in scheme: Tegneregler
top concept of: Tegneregler
definition: Dokumentet gir en presentasjon over anbefalt kartografi ved bruk av datasettet Reindrift – Årstidsbeite - Vårbeite
description: Dokumentet gir en presentasjon over anbefalt kartografi ved bruk av datasettet Reindrift – Årstidsbeite - Vårbeite
status: Gyldig

Bunntyper fra sjømåling
type: Concept
in scheme: Tegneregler
top concept of: Tegneregler
definition: Dokumentet gir en presentasjon over anbefalt kartografi ved bruk av datasettet Bunntyper fra sjømåling
description: Dokumentet gir en presentasjon over anbefalt kartografi ved bruk av datasettet Bunntyper fra sjømåling
status: Gyldig

Sjøkart - Dybdedata
type: Concept
in scheme: Tegneregler
top concept of: Tegneregler
definition: Dokumentet gir en presentasjon over anbefalt kartografi ved bruk av datasettet.
description: Dokumentet gir en presentasjon over anbefalt kartografi ved bruk av datasettet.
status: Gyldig

Arealplan og digitalt planregister
type: Concept
in scheme: Tegneregler
top concept of: Tegneregler
definition: Nasjonal produktspesifikasjon for arealplan og digitalt planregister. Kommuneplan og reguleringsplan
description: Nasjonal produktspesifikasjon for arealplan og digitalt planregister. Kommuneplan og reguleringsplan
status: Gyldig

Stormflo og havnivå
type: Concept
in scheme: Tegneregler
top concept of: Tegneregler
definition: Dokumentet gir en presentasjon over anbefalt kartografi ved bruk av datasettet "Stormflo og havnivå".
description: Dokumentet gir en presentasjon over anbefalt kartografi ved bruk av datasettet "Stormflo og havnivå".
status: Gyldig

Gyteområder Presentasjonsregler
type: Concept
in scheme: Tegneregler
top concept of: Tegneregler
definition: Presentasjonsregler for Fiskeridirektoratets datasettet Gyteområder
description: Presentasjonsregler for Fiskeridirektoratets datasettet Gyteområder
status: Gyldig

IUA
type: Concept
in scheme: Tegneregler
top concept of: Tegneregler
definition: Dokumentet gir en presentasjon over anbefalt kartografi ved bruk av datasettet IUA
description: Dokumentet gir en presentasjon over anbefalt kartografi ved bruk av datasettet IUA
status: Gyldig

Miljøregistrering i skog
type: Concept
in scheme: Tegneregler
top concept of: Tegneregler
definition: Dokumentet gir en presentasjon over anbefalt kartografi ved bruk av datasettet Miljøregistrering i skog
description: Dokumentet gir en presentasjon over anbefalt kartografi ved bruk av datasettet Miljøregistrering i skog
status: Gyldig

Reindrift - Restriksjonsområde
type: Concept
in scheme: Tegneregler
top concept of: Tegneregler
definition: Dokumentet gir en presentasjon over anbefalt kartografi ved bruk av datasettet Reindrift Restriksjonsområde.
description: Dokumentet gir en presentasjon over anbefalt kartografi ved bruk av datasettet Reindrift Restriksjonsområde.
status: Gyldig

SR16
type: Concept
in scheme: Tegneregler
top concept of: Tegneregler
definition: Dokumentet gir en presentasjon over anbefalt kartografi ved bruk av datasettet SR16.
description: Dokumentet gir en presentasjon over anbefalt kartografi ved bruk av datasettet SR16.
status: Gyldig

Mektighet av kvartære sedimenter på norsk kontinentalsokkel
type: Concept
in scheme: Tegneregler
top concept of: Tegneregler
definition: Dokumentet gir en presentasjon over anbefalt kartografi ved bruk av datasett Mektighet av kvartære sedimenter på norsk kontinentalsokkel
description: Dokumentet gir en presentasjon over anbefalt kartografi ved bruk av datasett Mektighet av kvartære sedimenter på norsk kontinentalsokkel
status: Gyldig

Tilgjengelighet
type: Concept
in scheme: Tegneregler
top concept of: Tegneregler
definition: Dokumentet gir en presentasjon over anbefalt kartografi ved bruk av datasettet.
description: Dokumentet gir en presentasjon over anbefalt kartografi ved bruk av datasettet.
status: Sendt inn

Marine biotoper i Sør-Troms
type: Concept
in scheme: Tegneregler
top concept of: Tegneregler
definition: Dokumentet gir en presentasjon over anbefalt kartografi ved bruk av datasettet Marine biotoper i Sør-Troms
description: Dokumentet gir en presentasjon over anbefalt kartografi ved bruk av datasettet Marine biotoper i Sør-Troms
status: Gyldig

Artsmangfold - videoobservasjoner
type: Concept
in scheme: Tegneregler
top concept of: Tegneregler
definition: Dokumentet gir en presentasjon over anbefalt kartografi ved bruk av datasettet.
description: Dokumentet gir en presentasjon over anbefalt kartografi ved bruk av datasettet.
status: Gyldig

N250 Kartdata
type: Concept
in scheme: Tegneregler
top concept of: Tegneregler
definition: Dokumentet gir en presentasjon over anbefalt kartografi ved bruk av datasettet N250 Kartdata.
description: Dokumentet gir en presentasjon over anbefalt kartografi ved bruk av datasettet N250 Kartdata.
status: Gyldig

Steinsprang - aktsomhetsområder
type: Concept
in scheme: Tegneregler
top concept of: Tegneregler
definition: Dokumentet gir en presentasjon over anbefalt kartografi ved bruk av datasettet Aktsomhetsområder steinsprang
description: Dokumentet gir en presentasjon over anbefalt kartografi ved bruk av datasettet Aktsomhetsområder steinsprang
status: Gyldig

Gravplass
type: Concept
in scheme: Tegneregler
top concept of: Tegneregler
definition: Dokumentet gir en presentasjon over anbefalt kartografi ved bruk av datasettet.
description: Dokumentet gir en presentasjon over anbefalt kartografi ved bruk av datasettet.
status: Gyldig

Elveg
type: Concept
in scheme: Tegneregler
top concept of: Tegneregler
definition: Dokumentet gir en presentasjon over anbefalt kartografi ved bruk av datasettet Elveg.
description: Dokumentet gir en presentasjon over anbefalt kartografi ved bruk av datasettet Elveg.
status: Gyldig

Kvikkleire
type: Concept
in scheme: Tegneregler
top concept of: Tegneregler
definition: Dokumentet gir en presentasjon over anbefalt kartografi ved bruk av datasettet kvikkleire
description: Dokumentet gir en presentasjon over anbefalt kartografi ved bruk av datasettet kvikkleire
status: Gyldig

Nettanlegg
type: Concept
in scheme: Tegneregler
top concept of: Tegneregler
definition: Dokumentet gir en presentasjon over anbefalt kartografi ved bruk av datasettet Nettanlegg
description: Dokumentet gir en presentasjon over anbefalt kartografi ved bruk av datasettet Nettanlegg
status: Gyldig

Avrenning fra Forsvarets skyte- og øvingsfelt
type: Concept
in scheme: Tegneregler
top concept of: Tegneregler
definition: Dokumentet gir en presentasjon over anbefalt kartografi ved bruk av datasettet Avrenning fra forsvarets skyte- og øvingsfelt.
description: Dokumentet gir en presentasjon over anbefalt kartografi ved bruk av datasettet Avrenning fra forsvarets skyte- og øvingsfelt.
status: Gyldig

Støysoner for tunge våpen i Forsvarets skyte- og øvingsfelt
type: Concept
in scheme: Tegneregler
top concept of: Tegneregler
definition: Dokumentet gir en presentasjon over anbefalt kartografi ved bruk av datasettet.
description: Dokumentet gir en presentasjon over anbefalt kartografi ved bruk av datasettet.
status: Gyldig

N500 Kartdata
type: Concept
in scheme: Tegneregler
top concept of: Tegneregler
definition: Dokumentet gir en presentasjon over anbefalt kartografi ved bruk av datasettet N500 Kartdata
description: Dokumentet gir en presentasjon over anbefalt kartografi ved bruk av datasettet N500 Kartdata
status: Gyldig

Erosjonsrisiko
type: Concept
in scheme: Tegneregler
top concept of: Tegneregler
status: Gyldig

Eksplosivanlegg
type: Concept
in scheme: Tegneregler
top concept of: Tegneregler
definition: Dokumentet gir en presentasjon over anbefalt kartografi ved bruk av datasettet Eksplosivanlegg.
description: Dokumentet gir en presentasjon over anbefalt kartografi ved bruk av datasettet Eksplosivanlegg.
status: Gyldig

Barmarksløyper i Finnmark
type: Concept
in scheme: Tegneregler
top concept of: Tegneregler
definition: Dokumentet gir en presentasjon over anbefalt kartografi ved bruk av datasettet.
description: Dokumentet gir en presentasjon over anbefalt kartografi ved bruk av datasettet.
status: Sendt inn

FKB-Arealbruk
type: Concept
in scheme: Tegneregler
top concept of: Tegneregler
definition: Dokumentet gir en presentasjon over anbefalt kartografi ved bruk av datasettet "FKB-Arealbruk"
description: Dokumentet gir en presentasjon over anbefalt kartografi ved bruk av datasettet "FKB-Arealbruk"
status: Gyldig

Mareano kjemistasjoner
type: Concept
in scheme: Tegneregler
top concept of: Tegneregler
definition: Anbefalt kartografi for datasettet.
description: Anbefalt kartografi for datasettet.
status: Gyldig

Vbase
type: Concept
in scheme: Tegneregler
top concept of: Tegneregler
definition: Dokumentet gir en presentasjon over anbefalt kartografi ved bruk av datasettet Vbase.
description: Dokumentet gir en presentasjon over anbefalt kartografi ved bruk av datasettet Vbase.
status: Gyldig

Kulturminner - Lokaliteter
type: Concept
in scheme: Tegneregler
top concept of: Tegneregler
definition: Dokumentet gir presentasjonsregler for datasettet Kulturminner - Lokaliteter
description: Dokumentet gir presentasjonsregler for datasettet Kulturminner - Lokaliteter
status: Utkast

Uran aktsomhet
type: Concept
in scheme: Tegneregler
top concept of: Tegneregler
definition: Dokumentet gir tegneregler for datasettet Uran aktsomhet.
description: Dokumentet gir tegneregler for datasettet Uran aktsomhet.
status: Sendt inn

Reindrift - Beitehage
type: Concept
in scheme: Tegneregler
top concept of: Tegneregler
definition: Dokumentet gir en presentasjon over anbefalt kartografi ved bruk av datasettet Reindrift - Beitehage
description: Dokumentet gir en presentasjon over anbefalt kartografi ved bruk av datasettet Reindrift - Beitehage
status: Gyldig

Turrutebasen
type: Concept
in scheme: Tegneregler
top concept of: Tegneregler
definition: Dokumentet gir en presentasjon over anbefalt kartografi ved bruk av datasettet Tur- og friluftsruter.
description: Dokumentet gir en presentasjon over anbefalt kartografi ved bruk av datasettet Tur- og friluftsruter.
status: Gyldig

Utvalgte naturtyper
type: Concept
in scheme: Tegneregler
top concept of: Tegneregler
status: Gyldig

Helling
type: Concept
in scheme: Tegneregler
top concept of: Tegneregler
definition: Dokumentet gir en presentasjon over anbefalt kartografi ved bruk av datasettet Helling
description: Dokumentet gir en presentasjon over anbefalt kartografi ved bruk av datasettet Helling
status: Gyldig

Bunnfellingsområder
type: Concept
in scheme: Tegneregler
top concept of: Tegneregler
definition: Dokumentet gir en presentasjon over anbefalt kartografi ved bruk av datasett Bunnfellingsområder. Bunnfellingsområder er naturlige forsenkninger på sjøbunnen med meget svake bunnstrømmer og fine sedimenter (silt og leire).
description: Dokumentet gir en presentasjon over anbefalt kartografi ved bruk av datasett Bunnfellingsområder. Bunnfellingsområder er naturlige forsenkninger på sjøbunnen med meget svake bunnstrømmer og fine sedimenter (silt og leire).
status: Gyldig

Sannsynlige forekomster av korallrev
type: Concept
in scheme: Tegneregler
top concept of: Tegneregler
definition: Dokumentet gir en presentasjon over anbefalt kartografi ved bruk av datasettet Sannsynlige forekomster av korallrev
description: Dokumentet gir en presentasjon over anbefalt kartografi ved bruk av datasettet Sannsynlige forekomster av korallrev
status: Gyldig

Korallrev
type: Concept
in scheme: Tegneregler
top concept of: Tegneregler
definition: Dokumentet gir en presentasjon over anbefalt kartografi ved bruk av datasettet Korallrev
description: Dokumentet gir en presentasjon over anbefalt kartografi ved bruk av datasettet Korallrev
status: Gyldig

Mineralressurser - areal og verdivurdering
type: Concept
in scheme: Tegneregler
top concept of: Tegneregler
definition: Dokumentet gir en presentasjon over anbefalt kartografi ved bruk av datasettet
description: Dokumentet gir en presentasjon over anbefalt kartografi ved bruk av datasettet
status: Gyldig

Skjellsand - observasjoner
type: Concept
in scheme: Tegneregler
top concept of: Tegneregler
definition: Dokumentet gir en presentasjon over anbefalt kartografi ved bruk av datasett Skjellsand - observasjon
description: Dokumentet gir en presentasjon over anbefalt kartografi ved bruk av datasett Skjellsand - observasjon
status: Gyldig

Marin grense
type: Concept
in scheme: Tegneregler
top concept of: Tegneregler
definition: Dokumentet gir tegneregler/tegnforklaring for datasettet Marin grense, og inneholder også tegneregler for Mulighet for marin leire
description: Dokumentet gir tegneregler/tegnforklaring for datasettet Marin grense, og inneholder også tegneregler for Mulighet for marin leire
status: Gyldig

Støysoner
type: Concept
in scheme: Tegneregler
top concept of: Tegneregler
definition: Dokumentet gir en presentasjon over anbefalt kartografi ved bruk av datasettet Støysoner.
description: Dokumentet gir en presentasjon over anbefalt kartografi ved bruk av datasettet Støysoner.
status: Gyldig

Matrikkelen Enkel WMS
type: Concept
in scheme: Tegneregler
top concept of: Tegneregler
definition: Dokumentet gir en presentasjon over anbefalt kartografi ved bruk av tjenesten "Matrikkelen Enkel WMS"
description: Dokumentet gir en presentasjon over anbefalt kartografi ved bruk av tjenesten "Matrikkelen Enkel WMS"
status: Gyldig

Svekket is
type: Concept
in scheme: Tegneregler
top concept of: Tegneregler
definition: Dokumentet gir en presentasjon over anbefalt kartografi ved bruk av datasettet Svekket is
description: Dokumentet gir en presentasjon over anbefalt kartografi ved bruk av datasettet Svekket is
status: Gyldig

FKB-LedningVa
type: Concept
in scheme: Tegneregler
top concept of: Tegneregler
definition: Dokumentet gir en presentasjon over anbefalt kartografi ved bruk av datasettet FKB-LedningVa
description: Dokumentet gir en presentasjon over anbefalt kartografi ved bruk av datasettet FKB-LedningVa
status: Gyldig

Snøskred aktsomhetsområder
type: Concept
in scheme: Tegneregler
top concept of: Tegneregler
definition: Tegneregler for datasettet snøskred aktsomhetsområder
description: Tegneregler for datasettet snøskred aktsomhetsområder
status: Tilbaketrukket

Kulturminner - Enkeltminner
type: Concept
in scheme: Tegneregler
top concept of: Tegneregler
definition: Dokumentet gir presentasjonsregler for datasettet Kulturminner - Enkeltminner
description: Dokumentet gir presentasjonsregler for datasettet Kulturminner - Enkeltminner
status: Utkast

Trafikkmengde
type: Concept
in scheme: Tegneregler
top concept of: Tegneregler
definition: Presentasjonsregler for NVDB trafikkmengde
description: Presentasjonsregler for NVDB trafikkmengde
status: Gyldig

Reindrift - Samebyrettsavgjørelse
type: Concept
in scheme: Tegneregler
top concept of: Tegneregler
status: Gyldig

FKB-Grønnstruktur
type: Concept
in scheme: Tegneregler
top concept of: Tegneregler
status: Gyldig

Søppel pr Mareano-stasjon
type: Concept
in scheme: Tegneregler
top concept of: Tegneregler
definition: Dokumentet gir en presentasjon over anbefalt kartografi ved bruk av datasettet.
description: Dokumentet gir en presentasjon over anbefalt kartografi ved bruk av datasettet.
status: Gyldig

Tettsteder
type: Concept
in scheme: Tegneregler
top concept of: Tegneregler
status: Gyldig

CLC (Corine Land Cover)
type: Concept
in scheme: Tegneregler
top concept of: Tegneregler
definition: Dokumentet gir en presentasjon over anbefalt kartografi ved bruk av datasettet CLC (Corine Land Cover)
description: Dokumentet gir en presentasjon over anbefalt kartografi ved bruk av datasettet CLC (Corine Land Cover)
status: Gyldig

Akkumulasjonsrater for organisk karbon i Nordsjøen og Skagerrak
type: Concept
in scheme: Tegneregler
top concept of: Tegneregler
definition: Dokumentet gir en overordnet presentasjon av "Akkumulasjonsrater for organisk karbon i Nordsjøen og Skagerrak"
description: Dokumentet gir en overordnet presentasjon av "Akkumulasjonsrater for organisk karbon i Nordsjøen og Skagerrak"
status: Gyldig

Forurenset grunn
type: Concept
in scheme: Tegneregler
top concept of: Tegneregler
definition: Dokumentet gir en presentasjon over anbefalt kartografi ved bruk av datasettet Forurenset grunn
description: Dokumentet gir en presentasjon over anbefalt kartografi ved bruk av datasettet Forurenset grunn
status: Gyldig

Viktige naturtyper
type: Concept
in scheme: Tegneregler
top concept of: Tegneregler
status: Gyldig

Sårbare marine biotoper – modellert utbredelse Umbellula bestander
type: Concept
in scheme: Tegneregler
top concept of: Tegneregler
definition: Dokumentet gir en presentasjon over anbefalt kartografi ved bruk av datasettet.
description: Dokumentet gir en presentasjon over anbefalt kartografi ved bruk av datasettet.
status: Gyldig

Konsentrasjon av organisk karbon i havbunnsedimenter i Nordsjøen og Skagerrak
type: Concept
in scheme: Tegneregler
top concept of: Tegneregler
definition: Dokumentet gir en overordnet presentasjon av produktet "Konsentrasjon av organisk karbon i havbunnsedimenter i Nordsjøen og Skagerrak".
description: Dokumentet gir en overordnet presentasjon av produktet "Konsentrasjon av organisk karbon i havbunnsedimenter i Nordsjøen og Skagerrak".
status: Gyldig

FKB Datakvalitet WMS
type: Concept
in scheme: Tegneregler
top concept of: Tegneregler
status: Sendt inn

Mareanoprøver Grabb - artsmangfold, individer og biomasse
type: Concept
in scheme: Tegneregler
top concept of: Tegneregler
definition: Dokumentet gir en presentasjon over anbefalt kartografi ved bruk av datasettet.
description: Dokumentet gir en presentasjon over anbefalt kartografi ved bruk av datasettet.
status: Gyldig

Skjellsand
type: Concept
in scheme: Tegneregler
top concept of: Tegneregler
definition: Dokumentet gir en presentasjon over anbefalt kartografi ved bruk av datasett "Skjellsand, forekomster" og "Skjellsand, observasjoner"
description: Dokumentet gir en presentasjon over anbefalt kartografi ved bruk av datasett "Skjellsand, forekomster" og "Skjellsand, observasjoner"
status: Gyldig

Barnetråkk - aggregert
type: Concept
in scheme: Tegneregler
top concept of: Tegneregler
definition: Dokumentet gir en presentasjon over anbefalt kartografi ved bruk av datasettet "Barnetråkk - forenklet".
description: Dokumentet gir en presentasjon over anbefalt kartografi ved bruk av datasettet "Barnetråkk - forenklet".
status: Gyldig

Aktsomhetskart for jord- og flomskred
type: Concept
in scheme: Tegneregler
top concept of: Tegneregler
definition: Dokumentet gir en presentasjon over anbefalt kartografi ved bruk av datasettet "Aktsomhetskart for jord- og flomskred"
description: Dokumentet gir en presentasjon over anbefalt kartografi ved bruk av datasettet "Aktsomhetskart for jord- og flomskred"
status: Gyldig

Nasjonalt grunnkart for arealanalyse (Testversjon 2)
type: Concept
in scheme: Tegneregler
top concept of: Tegneregler
definition: Grunnkart for arealanalyse (Testversjon 2)
description: Grunnkart for arealanalyse (Testversjon 2)
status: Utkast

Skredfaresoner
type: Concept
in scheme: Tegneregler
top concept of: Tegneregler
definition: Dokumentet gir en presentasjon over anbefalt kartografi ved bruk av datasettet Skredfaresoner
description: Dokumentet gir en presentasjon over anbefalt kartografi ved bruk av datasettet Skredfaresoner
status: Gyldig

Arter av nasjonal forvaltningsinteresse
type: Concept
in scheme: Tegneregler
top concept of: Tegneregler
definition: Dokumentet gir en presentasjon over anbefalt kartografi ved bruk av datasettet "Arter av nasjonal forvaltningsinteresse"
description: Dokumentet gir en presentasjon over anbefalt kartografi ved bruk av datasettet "Arter av nasjonal forvaltningsinteresse"
status: Gyldig

Mineralressurser
type: Concept
in scheme: Tegneregler
top concept of: Tegneregler
definition: Dokumentet gir en presentasjon over anbefalt kartografi ved bruk av datasettet Mineralressurser
description: Dokumentet gir en presentasjon over anbefalt kartografi ved bruk av datasettet Mineralressurser
status: Gyldig

Mareanoprøver Bomtrål - artsmangfold, individer og biomasse
type: Concept
in scheme: Tegneregler
top concept of: Tegneregler
definition: Dokumentet gir en presentasjon over anbefalt kartografi ved bruk av datasettet.
description: Dokumentet gir en presentasjon over anbefalt kartografi ved bruk av datasettet.
status: Gyldig

Vannkraft
type: Concept
in scheme: Tegneregler
top concept of: Tegneregler
definition: Dokumentet gir en presentasjon over anbefalt kartografi ved bruk av datasettet Vannkraft
description: Dokumentet gir en presentasjon over anbefalt kartografi ved bruk av datasettet Vannkraft
status: Gyldig

Statlige planretningslinjer for differensiert forvaltning av strandsonen langs sjøen
type: Concept
in scheme: Tegneregler
top concept of: Tegneregler
definition: Dokumentet gir en presentasjon over anbefalt kartografi ved bruk av datasettet Statlige planretningslinjer for differensiert forvaltning av strandsonen langs sjøen
description: Dokumentet gir en presentasjon over anbefalt kartografi ved bruk av datasettet Statlige planretningslinjer for differensiert forvaltning av strandsonen langs sjøen
status: Gyldig

N5 Kartdata
type: Concept
in scheme: Tegneregler
top concept of: Tegneregler
definition: Dokumentet gir en presentasjon over anbefalt kartografi ved bruk av datasettet N5 Kartdata
description: Dokumentet gir en presentasjon over anbefalt kartografi ved bruk av datasettet N5 Kartdata
status: Gyldig

Beredskapsdepot
type: Concept
in scheme: Tegneregler
top concept of: Tegneregler
definition: Dokumentet gir en presentasjon over anbefalt kartografi ved bruk av datasettet Beredskapsdepot
description: Dokumentet gir en presentasjon over anbefalt kartografi ved bruk av datasettet Beredskapsdepot
status: Gyldig

Losbordingsfelt
type: Concept
in scheme: Tegneregler
top concept of: Tegneregler
definition: Dokumentet gir en presentasjon over anbefalt kartografi ved bruk av datasettet Losbordingsfelt
description: Dokumentet gir en presentasjon over anbefalt kartografi ved bruk av datasettet Losbordingsfelt
status: Gyldig

Reindrift - Oppsamlingsområde
type: Concept
in scheme: Tegneregler
top concept of: Tegneregler
definition: Dokumentet gir en presentasjon over anbefalt kartografi ved bruk av datasettet Reindrift - Oppsamlingsområde
description: Dokumentet gir en presentasjon over anbefalt kartografi ved bruk av datasettet Reindrift - Oppsamlingsområde
status: Gyldig

Sikringstiltak
type: Concept
in scheme: Tegneregler
top concept of: Tegneregler
definition: Dokumentet gir en presentasjon over anbefalt kartografi ved bruk av datasettet Sikringstiltak
description: Dokumentet gir en presentasjon over anbefalt kartografi ved bruk av datasettet Sikringstiltak
status: Gyldig

FKB-Tekst5000
type: Concept
in scheme: Tegneregler
top concept of: Tegneregler
definition: Dokumentet gir en presentasjon over anbefalt kartografi ved bruk av datasettet FKB-Tekst5000
description: Dokumentet gir en presentasjon over anbefalt kartografi ved bruk av datasettet FKB-Tekst5000
status: Gyldig

Akvakulturlokaliteter
type: Concept
in scheme: Tegneregler
top concept of: Tegneregler
definition: Dokumentet gir en presentasjon over anbefalt kartografi ved bruk av datasettet "Akvakulturlokaliteter"
description: Dokumentet gir en presentasjon over anbefalt kartografi ved bruk av datasettet "Akvakulturlokaliteter"
status: Gyldig

Mareanoprøver Slede - artsmangfold, individer og biomasse
type: Concept
in scheme: Tegneregler
top concept of: Tegneregler
definition: Dokumentet gir en presentasjon over anbefalt kartografi ved bruk av datasettet.
description: Dokumentet gir en presentasjon over anbefalt kartografi ved bruk av datasettet.
status: Gyldig

Marine landskap
type: Concept
in scheme: Tegneregler
top concept of: Tegneregler
definition: Dokumentet gir en presentasjon over anbefalt kartografi ved bruk av datasettet Marine landskap
description: Dokumentet gir en presentasjon over anbefalt kartografi ved bruk av datasettet Marine landskap
status: Gyldig

Innsjø
type: Concept
in scheme: Tegneregler
top concept of: Tegneregler
definition: Dokumentet gir en presentasjon over anbefalt kartografi ved bruk av datasettet innsjø
description: Dokumentet gir en presentasjon over anbefalt kartografi ved bruk av datasettet innsjø
status: Gyldig

Reindrift - Siidaområde
type: Concept
in scheme: Tegneregler
top concept of: Tegneregler
definition: Dokumentet gir en presentasjon over anbefalt kartografi ved bruk av datasettet Reindrift - Siidaområde.
description: Dokumentet gir en presentasjon over anbefalt kartografi ved bruk av datasettet Reindrift - Siidaområde.
status: Gyldig

Jernbane - Banenettverk
type: Concept
in scheme: Tegneregler
top concept of: Tegneregler
definition: Banenettverk for statens jernbaneinfrastruktur i Norge
description: Banenettverk for statens jernbaneinfrastruktur i Norge
status: Gyldig

FKB-Veg
type: Concept
in scheme: Tegneregler
top concept of: Tegneregler
definition: Dokumentet gir en presentasjon over anbefalt kartografi ved bruk av datasettet FKB-Veg
description: Dokumentet gir en presentasjon over anbefalt kartografi ved bruk av datasettet FKB-Veg
status: Gyldig

Sårbare marine bunndyr - observasjonsdata Blomkålkorallskog
type: Concept
in scheme: Tegneregler
top concept of: Tegneregler
definition: Dokumentet gir en presentasjon over anbefalt kartografi ved bruk av datasettet.
description: Dokumentet gir en presentasjon over anbefalt kartografi ved bruk av datasettet.
status: Gyldig

FKB-Høydekurve
type: Concept
in scheme: Tegneregler
top concept of: Tegneregler
definition: Dokumentet gir en presentasjon over anbefalt kartografi ved bruk av datasettet FKB-Høydekurve
description: Dokumentet gir en presentasjon over anbefalt kartografi ved bruk av datasettet FKB-Høydekurve
status: Gyldig

Grunn gass
type: Concept
in scheme: Tegneregler
top concept of: Tegneregler
definition: Dokumentet gir en presentasjon over anbefalt kartografi ved bruk av datasettet Grunn gass, oversikt, Grunn gass, regional og Grunn gass, detaljert.
description: Dokumentet gir en presentasjon over anbefalt kartografi ved bruk av datasettet Grunn gass, oversikt, Grunn gass, regional og Grunn gass, detaljert.
status: Gyldig

Løsmasser
type: Concept
in scheme: Tegneregler
top concept of: Tegneregler
definition: Dokumentet gir en presentasjon over anbefalt kartografi ved bruk av datasettet Løsmasser
description: Dokumentet gir en presentasjon over anbefalt kartografi ved bruk av datasettet Løsmasser
status: Gyldig

Virksomhetsstatistikk på rutenett
type: Concept
in scheme: Tegneregler
top concept of: Tegneregler
definition: Dokumentet gir en presentasjon over anbefalt kartografi ved bruk av datasettet Virksomhetsstatistikk på rutenett
description: Dokumentet gir en presentasjon over anbefalt kartografi ved bruk av datasettet Virksomhetsstatistikk på rutenett
status: Gyldig

Sedimentobservasjoner - prøver
type: Concept
in scheme: Tegneregler
top concept of: Tegneregler
definition: Dokumentet gir en presentasjon over anbefalt kartografi ved bruk av Sedimentobservasjoner - prøver. Sedimentobservasjoner - prøver viser lokaliteter på havbunnen undersøkt med sedimentprøvetaking.
description: Dokumentet gir en presentasjon over anbefalt kartografi ved bruk av Sedimentobservasjoner - prøver. Sedimentobservasjoner - prøver viser lokaliteter på havbunnen undersøkt med sedimentprøvetaking.
status: Sendt inn

Støysoner for Forsvarets flyplasser
type: Concept
in scheme: Tegneregler
top concept of: Tegneregler
definition: Dokumentet gir en presentasjon over anbefalt kartografi ved bruk av datasettet.
description: Dokumentet gir en presentasjon over anbefalt kartografi ved bruk av datasettet.
status: Gyldig

FKB-AR5
type: Concept
in scheme: Tegneregler
top concept of: Tegneregler
definition: Dokumentet gir en presentasjon over anbefalt kartografi ved bruk av datasettet "FKB-AR5"
description: Dokumentet gir en presentasjon over anbefalt kartografi ved bruk av datasettet "FKB-AR5"
status: Gyldig

Symboler og forkortelser i norske sjøkart
type: Concept
in scheme: Tegneregler
top concept of: Tegneregler
definition: Den nautiske publikasjonen Symboler og forkortelser i norske sjøkart gir en oversikt over symboler og forkortelser som er brukt i norske og internasjonale sjøkart. Symboler og forkortelser i norske sjøkart er den norske utgaven av publikasjonen INT 1 – Symbols, Abbreviations and Terms used on Charts. Publikasjonen er basert på «Chart Specifications of the IHO» (International Hydrographic Organization) som ble fastsatt ved «XIIth International Hydrographic Conference» i 1982 i Monaco. Som et ledd i Kartverkets langsiktige strategi med frigivelse av data er publikasjonen nå fritt tilgjengelig i digitalt format (pdf).
description: Den nautiske publikasjonen Symboler og forkortelser i norske sjøkart gir en oversikt over symboler og forkortelser som er brukt i norske og internasjonale sjøkart. Symboler og forkortelser i norske sjøkart er den norske utgaven av publikasjonen INT 1 – Symbols, Abbreviations and Terms used on Charts. Publikasjonen er basert på «Chart Specifications of the IHO» (International Hydrographic Organization) som ble fastsatt ved «XIIth International Hydrographic Conference» i 1982 i Monaco. Som et ledd i Kartverkets langsiktige strategi med frigivelse av data er publikasjonen nå fritt tilgjengelig i digitalt format (pdf).
status: Gyldig

Forsvarets skyte- og øvingsfelt i sjø
type: Concept
in scheme: Tegneregler
top concept of: Tegneregler
definition: Dokumentet gir en presentasjon over anbefalt kartografi ved bruk av datasettet.
description: Dokumentet gir en presentasjon over anbefalt kartografi ved bruk av datasettet.
status: Gyldig

Landskap
type: Concept
in scheme: Tegneregler
top concept of: Tegneregler
definition: Dokumentet gir en presentasjon over anbefalt kartografi ved bruk av datasettet Landskap
description: Dokumentet gir en presentasjon over anbefalt kartografi ved bruk av datasettet Landskap
status: Gyldig

Reindrift - Konsesjonsområde
type: Concept
in scheme: Tegneregler
top concept of: Tegneregler
definition: Dokumentet gir en presentasjon over anbefalt kartografi ved bruk av datasettet Reindrift - Konsesjonsområde
description: Dokumentet gir en presentasjon over anbefalt kartografi ved bruk av datasettet Reindrift - Konsesjonsområde
status: Gyldig

Radon aktsomhet
type: Concept
in scheme: Tegneregler
top concept of: Tegneregler
definition: Dokumentet gir presentasjonsregler for datasettet Radon aktsomhet (Nasjonalt aktsomhetskart for radon)
description: Dokumentet gir presentasjonsregler for datasettet Radon aktsomhet (Nasjonalt aktsomhetskart for radon)
status: Gyldig

Tare - høstefelt
type: Concept
in scheme: Tegneregler
top concept of: Tegneregler
definition: Dokumentet gir en presentasjon over anbefalt kartografi ved bruk av datasettet.
description: Dokumentet gir en presentasjon over anbefalt kartografi ved bruk av datasettet.
status: Gyldig