Produktark
type: ConceptScheme
description: Inneholder organisasjoners produktark for kart og geodata

Vannmasser - Bunnstrøm
type: Concept
in scheme: Produktark
top concept of: Produktark
definition: Dokumentet gir en overordnet presentasjon av produktet.
description: Dokumentet gir en overordnet presentasjon av produktet.
status: Gyldig

Markfuktighet - DTW
type: Concept
in scheme: Produktark
top concept of: Produktark
definition: Dokumentet gir en overordnet presentasjon av produktet markfuktighet.
description: Dokumentet gir en overordnet presentasjon av produktet markfuktighet.
status: Gyldig

Sedimentasjonsrater i havbunnsedimenter i Nordsjøen og Skagerrak
type: Concept
in scheme: Produktark
top concept of: Produktark
definition: Dokumentet gir en overordnet presentasjon av datasettet "Sedimentasjonsrater i havbunnsedimenter i Nordsjøen og Skagerrak". Datasettet gir en oversikt over sedimentasjonsrater i de øverste ti centimeterne av havbunnsedimenter i Nordsjøen og Skagerrak.
description: Dokumentet gir en overordnet presentasjon av datasettet "Sedimentasjonsrater i havbunnsedimenter i Nordsjøen og Skagerrak". Datasettet gir en oversikt over sedimentasjonsrater i de øverste ti centimeterne av havbunnsedimenter i Nordsjøen og Skagerrak.
status: Gyldig

Kulturminner - SEFRAK
type: Concept
in scheme: Produktark
top concept of: Produktark
definition: Dokumentet gir en overordnet presentasjon av produktet Kulturminner – SEFRAK. Datasettet viser bygninger og andre kulturminner som er registrert i SEFRAK-registeret.
description: Dokumentet gir en overordnet presentasjon av produktet Kulturminner – SEFRAK. Datasettet viser bygninger og andre kulturminner som er registrert i SEFRAK-registeret.
status: Gyldig

Forsvarets skyte- og øvingsfelt i sjø
type: Concept
in scheme: Produktark
top concept of: Produktark
definition: Dokumentet gir en overordnet presentasjon av produktet.
description: Dokumentet gir en overordnet presentasjon av produktet.
status: Gyldig

Støysoner for Forsvarets flyplasser
type: Concept
in scheme: Produktark
top concept of: Produktark
definition: Dokumentet gir en overordnet presentasjon av produktet.
description: Dokumentet gir en overordnet presentasjon av produktet.
status: Gyldig

N250 Raster
type: Concept
in scheme: Produktark
top concept of: Produktark
definition: Dokumentet gir en overordnet presentasjon av produktet N250 Raster. Dataene har topografisk informasjon lik N250 Kartdata.
description: Dokumentet gir en overordnet presentasjon av produktet N250 Raster. Dataene har topografisk informasjon lik N250 Kartdata.
status: Gyldig

Villreinområder
type: Concept
in scheme: Produktark
top concept of: Produktark
definition: Dokumentet gir en overordnet presentasjon av produktet Villreinområder, som er et datasett som inneholder administrativ informasjon knyttet til villreinområdenes geografiske utstrekning, tellende areal, valdgrenser og villreinregioner.
description: Dokumentet gir en overordnet presentasjon av produktet Villreinområder, som er et datasett som inneholder administrativ informasjon knyttet til villreinområdenes geografiske utstrekning, tellende areal, valdgrenser og villreinregioner.
status: Gyldig

Virksomhetsstatistikk på rutenett
type: Concept
in scheme: Produktark
top concept of: Produktark
definition: Dokumentet gir en overordnet presentasjon av produktet Virksomhetsstatistikk på rutenett. Dataene inneholder virksomhetsstatistikk
description: Dokumentet gir en overordnet presentasjon av produktet Virksomhetsstatistikk på rutenett. Dataene inneholder virksomhetsstatistikk
status: Gyldig

Hornkoraller
type: Concept
in scheme: Produktark
top concept of: Produktark
definition: Dokumentet gir en overordnet presentasjon av produktet.
description: Dokumentet gir en overordnet presentasjon av produktet.
status: Gyldig

Bunnsedimenter (kornstørrelse), detaljert
type: Concept
in scheme: Produktark
top concept of: Produktark
definition: Dokumentet gir en overordnet presentasjon av produktet bunnsedimenter (kornstørrelse), detaljert - M 1:25.000. Dataene viser kornstørrelsessammensetning i sjøbunnsedimentenes øvre del (øverste 0-50 cm av sjøbunnen).
description: Dokumentet gir en overordnet presentasjon av produktet bunnsedimenter (kornstørrelse), detaljert - M 1:25.000. Dataene viser kornstørrelsessammensetning i sjøbunnsedimentenes øvre del (øverste 0-50 cm av sjøbunnen).
status: Gyldig

Mareano referansestasjoner
type: Concept
in scheme: Produktark
top concept of: Produktark
definition: Dokumentet gir en overordnet presentasjon av produktet.
description: Dokumentet gir en overordnet presentasjon av produktet.
status: Gyldig

Tare - høstefelt
type: Concept
in scheme: Produktark
top concept of: Produktark
definition: Dokumentet gir en overordnet presentasjon av produktet tare - høstefelt.
description: Dokumentet gir en overordnet presentasjon av produktet tare - høstefelt.
status: Gyldig

Høydedata - laser
type: Concept
in scheme: Produktark
top concept of: Produktark
status: Gyldig

Marine landformer
type: Concept
in scheme: Produktark
top concept of: Produktark
definition: Dokumentet gir en overordnet presentasjon av datasettet Marine landformer. Datasettet viser en rekke landskapsformer på havbunnen på norsk kontinentalsokkel og i fjordene.
description: Dokumentet gir en overordnet presentasjon av datasettet Marine landformer. Datasettet viser en rekke landskapsformer på havbunnen på norsk kontinentalsokkel og i fjordene.
status: Gyldig

Brannstasjoner
type: Concept
in scheme: Produktark
top concept of: Produktark
status: Gyldig

N5000 Raster
type: Concept
in scheme: Produktark
top concept of: Produktark
definition: Dokumentet gir en overordnet presentasjon av produktet N5000 Raster. N5000 Raster har topografisk informasjon lik N5000 Kartdata
description: Dokumentet gir en overordnet presentasjon av produktet N5000 Raster. N5000 Raster har topografisk informasjon lik N5000 Kartdata
status: Gyldig

Friluftslivets ferdselsårer - dekningskart
type: Concept
in scheme: Produktark
top concept of: Produktark
status: Gyldig

Befolkning på grunnkretsnivå
type: Concept
in scheme: Produktark
top concept of: Produktark
status: Gyldig

Reindrift - Årstidsbeite - Høstvinterbeite
type: Concept
in scheme: Produktark
top concept of: Produktark
definition: Dokumentet gir en overordnet presentasjon av produktet Reindrift - Årstidsbeite - Høstvinterbeite. Datasettet høstvinterbeite beskriver beiteområder for rein i deler av høstsesongen
description: Dokumentet gir en overordnet presentasjon av produktet Reindrift - Årstidsbeite - Høstvinterbeite. Datasettet høstvinterbeite beskriver beiteområder for rein i deler av høstsesongen
status: Gyldig

Trafikkmengde
type: Concept
in scheme: Produktark
top concept of: Produktark
definition: Dokumentet gir en overordnet presentasjon av produktet NVDB Trafikkmengde som gir informasjon om representativ trafikkmengde for en strekning
description: Dokumentet gir en overordnet presentasjon av produktet NVDB Trafikkmengde som gir informasjon om representativ trafikkmengde for en strekning
status: Gyldig

Restriksjonsområder - Naturvern
type: Concept
in scheme: Produktark
top concept of: Produktark
status: Gyldig

Naturtyper - KU-verdi
type: Concept
in scheme: Produktark
top concept of: Produktark
status: Gyldig

Aktsomhetskart for snøskred
type: Concept
in scheme: Produktark
top concept of: Produktark
definition: Dokumentet gir en overordnet presentasjon av datasettet Aktsomhetskart for snøskred
description: Dokumentet gir en overordnet presentasjon av datasettet Aktsomhetskart for snøskred
status: Gyldig

Kulturminner - lokaliteter
type: Concept
in scheme: Produktark
top concept of: Produktark
definition: Dokumentet gir en overordnet presentasjon av produktet Kulturminner - lokaliteter. En lokalitet er et avgrenset område med ett eller flere enkeltminner.
description: Dokumentet gir en overordnet presentasjon av produktet Kulturminner - lokaliteter. En lokalitet er et avgrenset område med ett eller flere enkeltminner.
status: Gyldig

Digitale ortofoto
type: Concept
in scheme: Produktark
top concept of: Produktark
definition: Dokumentet gir en overordnet presentasjon av produktet "Digitale ortofoto" som er en samling av digitale georefererte flybilder med kartets geometriske egenskaper.
description: Dokumentet gir en overordnet presentasjon av produktet "Digitale ortofoto" som er en samling av digitale georefererte flybilder med kartets geometriske egenskaper.
status: Gyldig

Setre i drift
type: Concept
in scheme: Produktark
top concept of: Produktark
definition: Dokumentet gir en overordnet presentasjon av produktet Setre i drift. Datasettet viser setre i drift som fekk tilskot gjennom Regionalt miljøprogram (RMP) i 2008.
description: Dokumentet gir en overordnet presentasjon av produktet Setre i drift. Datasettet viser setre i drift som fekk tilskot gjennom Regionalt miljøprogram (RMP) i 2008.
status: Gyldig

Statlig sikra friluftslivsområder
type: Concept
in scheme: Produktark
top concept of: Produktark
definition: Dokumentet gir en overordnet presentasjon av produktet Statlig sikra friluftslivsområder som er et datasett som viser områder som er sikra for allmenne friluftslivsformål ved statlig hjelp.
description: Dokumentet gir en overordnet presentasjon av produktet Statlig sikra friluftslivsområder som er et datasett som viser områder som er sikra for allmenne friluftslivsformål ved statlig hjelp.
status: Gyldig

Reference routes for navigation
type: Concept
in scheme: Produktark
top concept of: Produktark
status: Gyldig

Bergrettigheter
type: Concept
in scheme: Produktark
top concept of: Produktark
definition: Dokumentet gir en overordnet presentasjon av produktet Bergrettigheter. Datasettet inneholder informasjon om undersøkelses- og utvinningsretter
description: Dokumentet gir en overordnet presentasjon av produktet Bergrettigheter. Datasettet inneholder informasjon om undersøkelses- og utvinningsretter
status: Gyldig

Trua arter - hot spots
type: Concept
in scheme: Produktark
top concept of: Produktark
status: Gyldig

Mektighet av kvartære sedimenter på norsk kontinentalsokkel
type: Concept
in scheme: Produktark
top concept of: Produktark
definition: Dokumentet gir overordnet presentasjon av datasett Mektighet av kvartære sedimenter på norsk kontinentalsokkel
description: Dokumentet gir overordnet presentasjon av datasett Mektighet av kvartære sedimenter på norsk kontinentalsokkel
status: Gyldig

FKB-Naturinfo
type: Concept
in scheme: Produktark
top concept of: Produktark
definition: Dokumentet gir en overordnet presentasjon av produktet FKB-Naturinfo, som er et datasett som inneholder hekk, allè, enkeltstående trær og store steiner
description: Dokumentet gir en overordnet presentasjon av produktet FKB-Naturinfo, som er et datasett som inneholder hekk, allè, enkeltstående trær og store steiner
status: Gyldig

Verdifulle kulturlandskap
type: Concept
in scheme: Produktark
top concept of: Produktark
definition: Dokumentet gir en overordnet presentasjon av produktet Verdifulle kulturlandskap som er et datasett som viser forvaltningsmessig høyt prioriterte kulturlandskapsområder med både biologiske og kulturhistoriske verdier.
description: Dokumentet gir en overordnet presentasjon av produktet Verdifulle kulturlandskap som er et datasett som viser forvaltningsmessig høyt prioriterte kulturlandskapsområder med både biologiske og kulturhistoriske verdier.
status: Gyldig

Gytefelt hvitting, hyse, lyr og sei
type: Concept
in scheme: Produktark
top concept of: Produktark
status: Gyldig

Statistiske enheter Grunnkretser
type: Concept
in scheme: Produktark
top concept of: Produktark
definition: Dokumentet gir en overordnet presentasjon av produktet statistiske enheter grunnkretser
description: Dokumentet gir en overordnet presentasjon av produktet statistiske enheter grunnkretser
status: Gyldig

Jernbane - Banenettverk - Lineære referanser
type: Concept
in scheme: Produktark
top concept of: Produktark
definition: Dokumentet gir en overordnet presentasjon av produktet Jernbane - Banenettverk. Datasettet viser ankringsforhold på havbunnen tolket ut fra bunntype og dybde.
description: Dokumentet gir en overordnet presentasjon av produktet Jernbane - Banenettverk. Datasettet viser ankringsforhold på havbunnen tolket ut fra bunntype og dybde.
status: Gyldig

Boligstatistikk på rutenett
type: Concept
in scheme: Produktark
top concept of: Produktark
definition: Dokumentet gir en overordnet presentasjon av produktet Boligstatistikk på rutenett. Datasettet inneholder boigstatistikk på rutenett.
description: Dokumentet gir en overordnet presentasjon av produktet Boligstatistikk på rutenett. Datasettet inneholder boigstatistikk på rutenett.
status: Gyldig

Friluftslivsområder - vernede
type: Concept
in scheme: Produktark
top concept of: Produktark
status: Gyldig

Anadrome laksefisk - Vandringshinder
type: Concept
in scheme: Produktark
top concept of: Produktark
status: Gyldig

Grunnskole
type: Concept
in scheme: Produktark
top concept of: Produktark
definition: Dokumentet gir en overordnet presentasjon av produktet Grunnskole.
description: Dokumentet gir en overordnet presentasjon av produktet Grunnskole.
status: Gyldig

Atuomatisk identifikasjonssystem (AIS) - Shipsposisjoner
type: Concept
in scheme: Produktark
top concept of: Produktark
definition: Dokumentet gir en overordnet presentasjon av produktet.
description: Dokumentet gir en overordnet presentasjon av produktet.
status: Gyldig

Opplagsområder
type: Concept
in scheme: Produktark
top concept of: Produktark
definition: Dokumentet gir en overordnet presentasjon av produktet.
description: Dokumentet gir en overordnet presentasjon av produktet.
status: Gyldig

Deldatasett aktsomhet mellomstore flomskred
type: Concept
in scheme: Produktark
top concept of: Produktark
definition: Produktark for Deldatasett aktsomhet mellomstore flomskred
description: Produktark for Deldatasett aktsomhet mellomstore flomskred
status: Gyldig

Bygningsmassestatistikk på ruter
type: Concept
in scheme: Produktark
top concept of: Produktark
definition: Dokumentet gir en overordnet presentasjon av datasettet "Bygningsmassestatistikk på ruter".
description: Dokumentet gir en overordnet presentasjon av datasettet "Bygningsmassestatistikk på ruter".
status: Gyldig

Vbase
type: Concept
in scheme: Produktark
top concept of: Produktark
definition: Dokumentet gir en overordnet presentasjon av produktet Vbase. Innhold: vegnett (kjørbare veger lengre enn 50 meter), gang- og sykkelvegnett, adresseinformasjon, trafikkreguleringer og vegsperringer.
description: Dokumentet gir en overordnet presentasjon av produktet Vbase. Innhold: vegnett (kjørbare veger lengre enn 50 meter), gang- og sykkelvegnett, adresseinformasjon, trafikkreguleringer og vegsperringer.
status: Gyldig

Anlegg med farlig stoff
type: Concept
in scheme: Produktark
top concept of: Produktark
definition: Dokumentet gir en overordnet presentasjon av produktet Anlegg med farlig stoff som er et datasett som viser anlegg med farlig stoff, dvs. brannfarlig og giftig gass, stoff og væske.
description: Dokumentet gir en overordnet presentasjon av produktet Anlegg med farlig stoff som er et datasett som viser anlegg med farlig stoff, dvs. brannfarlig og giftig gass, stoff og væske.
status: Gyldig

Nasjonal database for grunnundersøkelser (NADAG)
type: Concept
in scheme: Produktark
top concept of: Produktark
definition: Dokumentet gir en overordnet presentasjon av produktet Nasjonal database for grunnundersøkelser (NADAG)
description: Dokumentet gir en overordnet presentasjon av produktet Nasjonal database for grunnundersøkelser (NADAG)
status: Gyldig

Sannsynlige forekomster av korallrev - felles
type: Concept
in scheme: Produktark
top concept of: Produktark
definition: Dokumentet gir en overordnet presentasjon av produktet Sannsynlige forekomster av korallrev. Disse dataene omfatter fire datasett, som er et resultat av automatisk klassifisering av høyoppløselige dybdedata. Datasettene viser sannsynlig utbredelse av korallrev. Datasettene dekker deler av Norskehavet fra kysten til eggakanten, fra Aktivneset i sør til Tromsøflaket i nord.
description: Dokumentet gir en overordnet presentasjon av produktet Sannsynlige forekomster av korallrev. Disse dataene omfatter fire datasett, som er et resultat av automatisk klassifisering av høyoppløselige dybdedata. Datasettene viser sannsynlig utbredelse av korallrev. Datasettene dekker deler av Norskehavet fra kysten til eggakanten, fra Aktivneset i sør til Tromsøflaket i nord.
status: Gyldig

INSPIRE - Transport Network Water
type: Concept
in scheme: Produktark
top concept of: Produktark
definition: The document provides an overview of the product
description: The document provides an overview of the product
status: Gyldig

Stormflo og havnivå
type: Concept
in scheme: Produktark
top concept of: Produktark
definition: Høye vannstander (stormflo) ved dagens havnivå og ved et framtidig havnivå i år 2100 eller 2150 som DSB anbefaler kommunene å bruke i sin veileder «Havnivåstigning og høye vannstander i samfunnsplanlegging» fra 2024.
description: Høye vannstander (stormflo) ved dagens havnivå og ved et framtidig havnivå i år 2100 eller 2150 som DSB anbefaler kommunene å bruke i sin veileder «Havnivåstigning og høye vannstander i samfunnsplanlegging» fra 2024.
status: Gyldig

Sjøkart - Maritim infrastruktur
type: Concept
in scheme: Produktark
top concept of: Produktark
definition: Dokumentet gir en overordnet presentasjon av produktet.
description: Dokumentet gir en overordnet presentasjon av produktet.
status: Gyldig

Gyteområder
type: Concept
in scheme: Produktark
top concept of: Produktark
definition: Dokumentet gir en overordnet presentasjon av produktet Gyteområder. Datasettet viser områder hvor det blir fanget gytefisk, hvilken art og gyteperiode.
description: Dokumentet gir en overordnet presentasjon av produktet Gyteområder. Datasettet viser områder hvor det blir fanget gytefisk, hvilken art og gyteperiode.
status: Gyldig

Forsvarets skyte- og øvingsfelt land
type: Concept
in scheme: Produktark
top concept of: Produktark
definition: Dokumentet gir en overordnet presentasjon av produktet forsvarets skyte- og øvingsfelt. Geodatasettet inneholder den flatemessige utbredelsen av militære skyte- og øvingsfelt avgrenset av Forsvarets eide/leide grunn, og Forsvarets ervervede rettigheter til bruk av arealet til skyte- og øvingsaktivitet, herunder også klausulerte fareområder (sikkerhetssoner).
description: Dokumentet gir en overordnet presentasjon av produktet forsvarets skyte- og øvingsfelt. Geodatasettet inneholder den flatemessige utbredelsen av militære skyte- og øvingsfelt avgrenset av Forsvarets eide/leide grunn, og Forsvarets ervervede rettigheter til bruk av arealet til skyte- og øvingsaktivitet, herunder også klausulerte fareområder (sikkerhetssoner).
status: Gyldig

Skredhendelser
type: Concept
in scheme: Produktark
top concept of: Produktark
definition: Dokumentet gir en overordnet presentasjon av produktet Skredhendelser, som er et datasett som beskriver skredhendelser. Mange typer skred gjentar seg på samme plass. Det gjelder både for de nesten årvisse skredene, som er et kjent problem i mange deler av landet, og for de langt mer sjeldne skredene
description: Dokumentet gir en overordnet presentasjon av produktet Skredhendelser, som er et datasett som beskriver skredhendelser. Mange typer skred gjentar seg på samme plass. Det gjelder både for de nesten årvisse skredene, som er et kjent problem i mange deler av landet, og for de langt mer sjeldne skredene
status: Gyldig

Naturtyper - NiN
type: Concept
in scheme: Produktark
top concept of: Produktark
definition: Dokumentet gir en overordnet presentasjon av produktet Naturtyper - NiN.
description: Dokumentet gir en overordnet presentasjon av produktet Naturtyper - NiN.
status: Gyldig

Statistiske enheter grunnkretser - historiske data
type: Concept
in scheme: Produktark
top concept of: Produktark
definition: Dokumentet gir en overordnet presentasjon av produktet Statistiske enheter grunnkretser - historiske data
description: Dokumentet gir en overordnet presentasjon av produktet Statistiske enheter grunnkretser - historiske data
status: Gyldig

Nettanlegg
type: Concept
in scheme: Produktark
top concept of: Produktark
status: Gyldig

Grunnvannsborehull
type: Concept
in scheme: Produktark
top concept of: Produktark
definition: Dokumentet gir en oversikt over datasettet Grunnvannsborehull. Datasettet gir en landsdekkende oversikt over borede grunnvannsbrønner, energibrønner og naturlige oppkommer av grunnvann (tidligere kalt kilder)
description: Dokumentet gir en oversikt over datasettet Grunnvannsborehull. Datasettet gir en landsdekkende oversikt over borede grunnvannsbrønner, energibrønner og naturlige oppkommer av grunnvann (tidligere kalt kilder)
status: Gyldig

Konnekteringspunkter mellom Norge og Sverige
type: Concept
in scheme: Produktark
top concept of: Produktark
status: Gyldig

Riggområder
type: Concept
in scheme: Produktark
top concept of: Produktark
definition: Dokumentet gir en overordnet presentasjon av produktet.
description: Dokumentet gir en overordnet presentasjon av produktet.
status: Gyldig

Gravbarhet
type: Concept
in scheme: Produktark
top concept of: Produktark
definition: Dokumentet gir en overordnet presentasjon av produktet Gravbarhet. Datasettet viser om det er lett eller vanskelig å grave i bunnen.
description: Dokumentet gir en overordnet presentasjon av produktet Gravbarhet. Datasettet viser om det er lett eller vanskelig å grave i bunnen.
status: Gyldig

Marine sedimentasjonmiljø
type: Concept
in scheme: Produktark
top concept of: Produktark
definition: Dokumentet gir en overordnet presentasjon av produktet marine sedimentasjonsmiljø. Dataene gir en oversikt over dominerende sedimentasjonsmiljø i området på norsk kontinentalsokkel.
description: Dokumentet gir en overordnet presentasjon av produktet marine sedimentasjonsmiljø. Dataene gir en oversikt over dominerende sedimentasjonsmiljø i området på norsk kontinentalsokkel.
status: Gyldig

Reindrift - Beitehage
type: Concept
in scheme: Produktark
top concept of: Produktark
definition: Dokumentet gir en overordnet presentasjon av produktet Reindrift - Beitehage. Beitehage for rein er et lukket gjerde der reinen samles/oppbevares i påvente av å føres i et arbeidsgjerde.
description: Dokumentet gir en overordnet presentasjon av produktet Reindrift - Beitehage. Beitehage for rein er et lukket gjerde der reinen samles/oppbevares i påvente av å føres i et arbeidsgjerde.
status: Gyldig

Kalkinnhold i berggrunn
type: Concept
in scheme: Produktark
top concept of: Produktark
definition: Dokumentet gir en overordnet presentasjon av produktet Kalkinnhold i berggrunn, og viser fordeling av ulike bergarter langs økoklinen kalkinnhold (KA).
description: Dokumentet gir en overordnet presentasjon av produktet Kalkinnhold i berggrunn, og viser fordeling av ulike bergarter langs økoklinen kalkinnhold (KA).
status: Gyldig

Gytefelt torsk MB
type: Concept
in scheme: Produktark
top concept of: Produktark
status: Sendt inn

N2000 Raster
type: Concept
in scheme: Produktark
top concept of: Produktark
definition: Dokumentet gir en overordnet presentasjon av produktet N2000 Raster. N2000 Raster har topografisk informasjon lik N2000 kartdata
description: Dokumentet gir en overordnet presentasjon av produktet N2000 Raster. N2000 Raster har topografisk informasjon lik N2000 kartdata
status: Gyldig

Naturtiltak
type: Concept
in scheme: Produktark
top concept of: Produktark
status: Sendt inn

Utbredelseskart Fisk
type: Concept
in scheme: Produktark
top concept of: Produktark
status: Sendt inn

Naturtyper - verdsatte
type: Concept
in scheme: Produktark
top concept of: Produktark
status: Gyldig

Gassoppkommer
type: Concept
in scheme: Produktark
top concept of: Produktark
definition: Dokumentet gir en overordnet presentasjon av produktet Gassoppkommer. Datasettet viser steder der vannkolonnedata fra multistråleekkolodd viser eller indikerer gassoppkommer fra havbunnen.
description: Dokumentet gir en overordnet presentasjon av produktet Gassoppkommer. Datasettet viser steder der vannkolonnedata fra multistråleekkolodd viser eller indikerer gassoppkommer fra havbunnen.
status: Gyldig

N1000 Kartdata
type: Concept
in scheme: Produktark
top concept of: Produktark
definition: Dokumentet gir en overordnet presentasjon av produktet N1000 Kartdata, som er et datasett som er tilpasset målestokk 1:700 000 til 1:1 500 000 og dekker fastlands-Norge begrenset av riksgrensen mot nabolandene og territorialgrensen i havet.
description: Dokumentet gir en overordnet presentasjon av produktet N1000 Kartdata, som er et datasett som er tilpasset målestokk 1:700 000 til 1:1 500 000 og dekker fastlands-Norge begrenset av riksgrensen mot nabolandene og territorialgrensen i havet.
status: Gyldig

Miljøverdier i Særlig verdifulle områder i havområdene
type: Concept
in scheme: Produktark
top concept of: Produktark
status: Gyldig

Vannmasser - Overflatesaltholdighet
type: Concept
in scheme: Produktark
top concept of: Produktark
definition: Dokumentet gir en overordnet presentasjon av produktet.
description: Dokumentet gir en overordnet presentasjon av produktet.
status: Gyldig

Berggrunn N250
type: Concept
in scheme: Produktark
top concept of: Produktark
definition: Dokumentet gir en overordnet presentasjon av produktet Berggrunn N250. Berggrunndataene viser utbredelsen av de forskjellige bergarter på jordens overflate.
description: Dokumentet gir en overordnet presentasjon av produktet Berggrunn N250. Berggrunndataene viser utbredelsen av de forskjellige bergarter på jordens overflate.
status: Tilbaketrukket

Løsmasser
type: Concept
in scheme: Produktark
top concept of: Produktark
definition: Dokumentet gir en oversikt over datasettet Løsmasser. Løsmassedataene viser hovedsaklig utbredelsen av løsmassetyper som dekker fjelloverflaten. Det meste av løsmassene ble dannet under og etter siste istid. Dataene viser kun hvilken jordart som dominerer i de øverste meterne av terrengoverflaten.
description: Dokumentet gir en oversikt over datasettet Løsmasser. Løsmassedataene viser hovedsaklig utbredelsen av løsmassetyper som dekker fjelloverflaten. Det meste av løsmassene ble dannet under og etter siste istid. Dataene viser kun hvilken jordart som dominerer i de øverste meterne av terrengoverflaten.
status: Gyldig

Markagrensen
type: Concept
in scheme: Produktark
top concept of: Produktark
definition: Dokumentet gir en overordnet presentasjon av produktet Markagrensen, som avgrenser område for virkeområdet til lov 6.juni 2009 nr. 35 om naturområder i Oslo og nærliggende kommuner (markaloven)
description: Dokumentet gir en overordnet presentasjon av produktet Markagrensen, som avgrenser område for virkeområdet til lov 6.juni 2009 nr. 35 om naturområder i Oslo og nærliggende kommuner (markaloven)
status: Gyldig

Hensynssoner kraftledninger
type: Concept
in scheme: Produktark
top concept of: Produktark
definition: Datasettet Hensynssoner kraftledninger inneholder byggeforbudssoner for Statnetts kraftledninger. Dette er arealer rundt kraftledninger som er klausulert i medhold av konsesjon etter energiloven og ekspropriasjon etter oreigningsloven eller minnelig avtale med berørte grunneiere.
description: Datasettet Hensynssoner kraftledninger inneholder byggeforbudssoner for Statnetts kraftledninger. Dette er arealer rundt kraftledninger som er klausulert i medhold av konsesjon etter energiloven og ekspropriasjon etter oreigningsloven eller minnelig avtale med berørte grunneiere.
status: Gyldig

Generelle marine biotoper
type: Concept
in scheme: Produktark
top concept of: Produktark
definition: Dokumentet gir overordnet presentasjon av datasett Generelle marine biotoper
description: Dokumentet gir overordnet presentasjon av datasett Generelle marine biotoper
status: Gyldig

Sårbare naturtyper i Sunnhordland – Svampskog på bløtbunn
type: Concept
in scheme: Produktark
top concept of: Produktark
status: Sendt inn

Dybdedata - rådata
type: Concept
in scheme: Produktark
top concept of: Produktark
definition: Dybdedata-rådata er de mest detaljerte dybdedataene Kartverket har. Dataene blir innsamlet ved kartlegging av havbunnen for Norges kyst og havområder. For store områder av kysten har vi detaljerte dybdedata innsamlet med multistråle ekkolodd. For andre områder finnes kun eldre målinger med grovere oppløsning. Eldre data erstattes kontinuerlig etterhvert som nye data blir samlet inn.
description: Dybdedata-rådata er de mest detaljerte dybdedataene Kartverket har. Dataene blir innsamlet ved kartlegging av havbunnen for Norges kyst og havområder. For store områder av kysten har vi detaljerte dybdedata innsamlet med multistråle ekkolodd. For andre områder finnes kun eldre målinger med grovere oppløsning. Eldre data erstattes kontinuerlig etterhvert som nye data blir samlet inn.
status: Gyldig

Miljøregistreringer i skog
type: Concept
in scheme: Produktark
top concept of: Produktark
definition: Dokumentet gir en overordnet presentasjon av produktet Miljøregistreringer i skog. MiS-figurer viser viktige biologiske områder (livs-miljøer) i skog.
description: Dokumentet gir en overordnet presentasjon av produktet Miljøregistreringer i skog. MiS-figurer viser viktige biologiske områder (livs-miljøer) i skog.
status: Gyldig

Inngrepsfri natur i Norge
type: Concept
in scheme: Produktark
top concept of: Produktark
status: Gyldig

Prioriteringskart - akutt forurensning
type: Concept
in scheme: Produktark
top concept of: Produktark
status: Gyldig

Matrikkelen - Bygningspunkt utvidet
type: Concept
in scheme: Produktark
top concept of: Produktark
status: Gyldig

N5000 Kartdata
type: Concept
in scheme: Produktark
top concept of: Produktark
definition: Dokumentet gir en overordnet presentasjon av produktet N5000 Kartdata, som er et datasett som er tilpasset målestokk 1:3 000 000 til 1:7 000 000 og dekker fastlands-Norge begrenset av riksgrensen mot nabolandene og territorialgrensen i havet.
description: Dokumentet gir en overordnet presentasjon av produktet N5000 Kartdata, som er et datasett som er tilpasset målestokk 1:3 000 000 til 1:7 000 000 og dekker fastlands-Norge begrenset av riksgrensen mot nabolandene og territorialgrensen i havet.
status: Gyldig

CORINE Land Cover (CLC)
type: Concept
in scheme: Produktark
top concept of: Produktark
definition: Dokumentet gir en overordnet presentasjon av produktet CORINE Land Cover (CLC). CLC er arealressurskart på europeisk nivå.
description: Dokumentet gir en overordnet presentasjon av produktet CORINE Land Cover (CLC). CLC er arealressurskart på europeisk nivå.
status: Gyldig

Sårbare naturtyper i Sunnhordland – Svampskog på fastbunn
type: Concept
in scheme: Produktark
top concept of: Produktark
status: Sendt inn

Vegetasjon
type: Concept
in scheme: Produktark
top concept of: Produktark
definition: Dokumentet gir en overordnet presentasjon av produktet Vegetasjon. Kartet gjev informasjon om artsfordeling, økologiske tilhøve og eigenskapar for ulik ressursbruk i utmark.
description: Dokumentet gir en overordnet presentasjon av produktet Vegetasjon. Kartet gjev informasjon om artsfordeling, økologiske tilhøve og eigenskapar for ulik ressursbruk i utmark.
status: Gyldig

Ilandstigningslokaliteter Svalbard
type: Concept
in scheme: Produktark
top concept of: Produktark
status: Gyldig

Naturtyper - DN-håndbok 13
type: Concept
in scheme: Produktark
top concept of: Produktark
status: Gyldig

Norges maritime grenser
type: Concept
in scheme: Produktark
top concept of: Produktark
definition: Dokumentet gir en overordnet presentasjon av produktet Norges maritime grenser, som er en samlebetegnelse for grenser og soner i havområder som inngår i Norges lover og forskrifter. Grensene og områdene er sammenstilt i et offisielt vektordatasett som dekker områdene Fastlands-Norge, Jan Mayen og Svalbard, samt Bouvetøya.
description: Dokumentet gir en overordnet presentasjon av produktet Norges maritime grenser, som er en samlebetegnelse for grenser og soner i havområder som inngår i Norges lover og forskrifter. Grensene og områdene er sammenstilt i et offisielt vektordatasett som dekker områdene Fastlands-Norge, Jan Mayen og Svalbard, samt Bouvetøya.
status: Gyldig

Skogsmark - NiN
type: Concept
in scheme: Produktark
top concept of: Produktark
status: Gyldig

Naturtyper - Sårbare habitater VME
type: Concept
in scheme: Produktark
top concept of: Produktark
definition: Naturtyper - Sårbare habitater VME punktdata
description: Naturtyper - Sårbare habitater VME punktdata
status: Gyldig

Reindrift - Konvensjonsområde
type: Concept
in scheme: Produktark
top concept of: Produktark
definition: Dokumentet gir en overordnet presentasjon av produktet Reindrift - Konvensjonsområde, som viser administrative grenser for svenske reineieres (samebyers) beiteområder i Norge. Områdegrensene er fastsatt i forskrift om beiteområder for svensk rein i Norge, jf. grensereinbeiteloven.
description: Dokumentet gir en overordnet presentasjon av produktet Reindrift - Konvensjonsområde, som viser administrative grenser for svenske reineieres (samebyers) beiteområder i Norge. Områdegrensene er fastsatt i forskrift om beiteområder for svensk rein i Norge, jf. grensereinbeiteloven.
status: Gyldig

FKB-Tekst5000
type: Concept
in scheme: Produktark
top concept of: Produktark
definition: Dokumentet gir en overordnet presentasjon av produktet FKB-Tekst5000, som er et datasett som er tilleggsdata til FKB som er nødvendige for å formidle en god presentasjon uten at deopprinnelige datasettene blir berørt. FKB-Tekst5000 er laget for presentasjon i målestokk 1:5000 (Økonomiske kart).
description: Dokumentet gir en overordnet presentasjon av produktet FKB-Tekst5000, som er et datasett som er tilleggsdata til FKB som er nødvendige for å formidle en god presentasjon uten at deopprinnelige datasettene blir berørt. FKB-Tekst5000 er laget for presentasjon i målestokk 1:5000 (Økonomiske kart).
status: Tilbaketrukket

Ankringsforhold
type: Concept
in scheme: Produktark
top concept of: Produktark
definition: Dokumentet gir en overordnet presentasjon av produktet Ankringsforhold. Datasettet viser ankringsforhold på havbunnen tolket ut fra bunntype og dybde.
description: Dokumentet gir en overordnet presentasjon av produktet Ankringsforhold. Datasettet viser ankringsforhold på havbunnen tolket ut fra bunntype og dybde.
status: Gyldig

N100 Kartdata
type: Concept
in scheme: Produktark
top concept of: Produktark
definition: Dokumentet gir en overordnet presentasjon av produktet.
description: Dokumentet gir en overordnet presentasjon av produktet.
status: Gyldig

Mineralressurser
type: Concept
in scheme: Produktark
top concept of: Produktark
definition: Dokumentet gir en overordnet presentasjon av produktet Mineralressurser. Dataene gir en oversikt over registrerte forekomster av industrimineraler, naturstein og metallressurser.
description: Dokumentet gir en overordnet presentasjon av produktet Mineralressurser. Dataene gir en oversikt over registrerte forekomster av industrimineraler, naturstein og metallressurser.
status: Gyldig

Truede arter 2015 - hot spots
type: Concept
in scheme: Produktark
top concept of: Produktark
status: Sendt inn

Naturtyper på land og i ferskvann (HB13)
type: Concept
in scheme: Produktark
top concept of: Produktark
status: Gyldig

Produktark NiN Grunntyper polygon
type: Concept
in scheme: Produktark
top concept of: Produktark
status: Gyldig

FKB-Vann
type: Concept
in scheme: Produktark
top concept of: Produktark
definition: Dokumentet gir en overordnet presentasjon av produktet FKB-Vann, som er et datasett som beskriver geografisk beliggenhet, forløp og form for bekker, elver, kanaler, grøfter, innsjøer, isbreer og den topografiske delen av kyst og sjø.
description: Dokumentet gir en overordnet presentasjon av produktet FKB-Vann, som er et datasett som beskriver geografisk beliggenhet, forløp og form for bekker, elver, kanaler, grøfter, innsjøer, isbreer og den topografiske delen av kyst og sjø.
status: Gyldig

Elveg
type: Concept
in scheme: Produktark
top concept of: Produktark
definition: Dokumentet gir en overordnet presentasjon av produktet Elveg. Innhold: vegnett (kjørbare veger lengre enn 50 meter), gang- og sykkelvegnett, adressepunkt, gatenavn, fartsgrenser, trafikkreguleringer og vegrestriksjoner.
description: Dokumentet gir en overordnet presentasjon av produktet Elveg. Innhold: vegnett (kjørbare veger lengre enn 50 meter), gang- og sykkelvegnett, adressepunkt, gatenavn, fartsgrenser, trafikkreguleringer og vegrestriksjoner.
status: Gyldig

Vannmasser - Bølgehøyde
type: Concept
in scheme: Produktark
top concept of: Produktark
definition: Dokumentet gir en overordnet presentasjon av produktet.
description: Dokumentet gir en overordnet presentasjon av produktet.
status: Gyldig

Brannalarmsentraler
type: Concept
in scheme: Produktark
top concept of: Produktark
definition: Dokumentet gir en overordnet presentasjon av datasettet Brannalarmsentraler. Datasettet viser lokalisering av brannalarmsentralene ("110-sentralene") i Norge og deres distrikter.
description: Dokumentet gir en overordnet presentasjon av datasettet Brannalarmsentraler. Datasettet viser lokalisering av brannalarmsentralene ("110-sentralene") i Norge og deres distrikter.
status: Gyldig

Radon - Alunskifer
type: Concept
in scheme: Produktark
top concept of: Produktark
definition: Dokumentet gir en overordnet presentasjon av produktet Radon-Alunskifer som er et datasett som viser oversikt over kjente forekomster av den radonutsatte bergarten alunskifer.
description: Dokumentet gir en overordnet presentasjon av produktet Radon-Alunskifer som er et datasett som viser oversikt over kjente forekomster av den radonutsatte bergarten alunskifer.
status: Utkast

Marine sedimentasjonsmiljø, detaljert
type: Concept
in scheme: Produktark
top concept of: Produktark
definition: Dokumentet gir en overordnet presentasjon av produktet marine sedimentasjonsmiljø, detaljert. Datasettet viser dominerende sedimentasjonsmiljø i kartlagte områder langs kysten og i fjordene.
description: Dokumentet gir en overordnet presentasjon av produktet marine sedimentasjonsmiljø, detaljert. Datasettet viser dominerende sedimentasjonsmiljø i kartlagte områder langs kysten og i fjordene.
status: Gyldig

SAT-SKOG
type: Concept
in scheme: Produktark
top concept of: Produktark
definition: Dokumentet gir en overordnet presentasjon av produktet SAT-SKOG. SAT-SKOG er et skogkart som gir oversikt over skogressursene og viser informasjon om treslag, alder og volum på et overordnet nivå.
description: Dokumentet gir en overordnet presentasjon av produktet SAT-SKOG. SAT-SKOG er et skogkart som gir oversikt over skogressursene og viser informasjon om treslag, alder og volum på et overordnet nivå.
status: Gyldig

Biotoper i Barentshavet
type: Concept
in scheme: Produktark
top concept of: Produktark
definition: Dokumentet gir overordnet presentasjon av datasett Miotoper i Barentshavet
description: Dokumentet gir overordnet presentasjon av datasett Miotoper i Barentshavet
status: Gyldig

Reindrift - Flyttlei
type: Concept
in scheme: Produktark
top concept of: Produktark
definition: Dokumentet gir en overordnet presentasjon av produktet Reindrift - Flyttlei. Datasettet beskriver lengre leier eller traséer i terrenget der reinen enten drives eller trekker selv mellom årstidsbeitene.
description: Dokumentet gir en overordnet presentasjon av produktet Reindrift - Flyttlei. Datasettet beskriver lengre leier eller traséer i terrenget der reinen enten drives eller trekker selv mellom årstidsbeitene.
status: Gyldig

Barnetråkk - aggregert
type: Concept
in scheme: Produktark
top concept of: Produktark
definition: Dokumentet gir en overordnet presentasjon av produktet.
description: Dokumentet gir en overordnet presentasjon av produktet.
status: Gyldig

Arter av nasjonal forvaltningsinteresse
type: Concept
in scheme: Produktark
top concept of: Produktark
definition: Dokumentet gir en overordnet presentasjon av produktet "Arter av nasjonal forvaltningsinteresse" som er et forvaltningsrettet datasett som distribueres av Miljødirektoratet
description: Dokumentet gir en overordnet presentasjon av produktet "Arter av nasjonal forvaltningsinteresse" som er et forvaltningsrettet datasett som distribueres av Miljødirektoratet
status: Gyldig

FKB-LedningVa
type: Concept
in scheme: Produktark
top concept of: Produktark
definition: Dokumentet gir en overordnet presentasjon av produktet FKB-LedningVa, som er et datasett som inneholder ledningsnettet som er synlig på terrengoverflaten (kum, sluk og hydrant) og ikke det fullstendige ledningsnettet
description: Dokumentet gir en overordnet presentasjon av produktet FKB-LedningVa, som er et datasett som inneholder ledningsnettet som er synlig på terrengoverflaten (kum, sluk og hydrant) og ikke det fullstendige ledningsnettet
status: Tilbaketrukket

Tilgjengelighet
type: Concept
in scheme: Produktark
top concept of: Produktark
definition: Dokumentet gir en overordnet presentasjon av produktet.
description: Dokumentet gir en overordnet presentasjon av produktet.
status: Gyldig

Grunnkart for arealregnskap (Testversjon 1)
type: Concept
in scheme: Produktark
top concept of: Produktark
definition: Grunnkartet kan testes ut som et et grunnlag for å etablere arealregnskap og kan suppleres med spesifikke data tilpasset ulike regnsapsformål
description: Grunnkartet kan testes ut som et et grunnlag for å etablere arealregnskap og kan suppleres med spesifikke data tilpasset ulike regnsapsformål
status: Sendt inn

Marine biotoper i Sør-Troms
type: Concept
in scheme: Produktark
top concept of: Produktark
definition: Dokumentet gir overordnet presentasjon av datasett Marine biotoper i Sør-Troms
description: Dokumentet gir overordnet presentasjon av datasett Marine biotoper i Sør-Troms
status: Gyldig

Landskap i ruter
type: Concept
in scheme: Produktark
top concept of: Produktark
definition: Dokumentet gir en overordnet presentasjon av produktet Landskap i ruter. Landskap i ruter er bygget opp av et rutenett med 5 x 5 km ruter hvor det til hver rute er knyttet en rekke dataverdier som beskriver natur- og kulturforhold (f.eks. terreng, klima, arealdekke, jordbruk).
description: Dokumentet gir en overordnet presentasjon av produktet Landskap i ruter. Landskap i ruter er bygget opp av et rutenett med 5 x 5 km ruter hvor det til hver rute er knyttet en rekke dataverdier som beskriver natur- og kulturforhold (f.eks. terreng, klima, arealdekke, jordbruk).
status: Gyldig

Storulykkeanlegg
type: Concept
in scheme: Produktark
top concept of: Produktark
definition: Dokumentet gir en overordnet presentasjon av produktet Storulykkeanleggsom er et datasett som viser alle anlegg i Norge som faller inn under storulykkeforskriften (forskrift om tiltak for å forebygge og begrense skadevirkningene av storulykker i virksomheter der farlige kjemikalier forekommer).
description: Dokumentet gir en overordnet presentasjon av produktet Storulykkeanleggsom er et datasett som viser alle anlegg i Norge som faller inn under storulykkeforskriften (forskrift om tiltak for å forebygge og begrense skadevirkningene av storulykker i virksomheter der farlige kjemikalier forekommer).
status: Gyldig

Geotekniske undersøkelser
type: Concept
in scheme: Produktark
top concept of: Produktark
definition: Data fra utførte geotekniske undersøkelser befinner seg i Nasjonal database for grunnundersøkelser (NADAG). Punktene i kartet representerer geotekniske borehull. I borehullspunktene vises metadata (f.eks. boretype, oppdragsfirma, oppdragsgiver, stedfestelse (posisjon), boret dybde (evt. dyp til fjell), rapportnr.). For noen punkter vil mer informasjon være tilgjengelig (f.eks. lenke til rapport og evt. til rådata, boreprofil og måleresultater).
description: Data fra utførte geotekniske undersøkelser befinner seg i Nasjonal database for grunnundersøkelser (NADAG). Punktene i kartet representerer geotekniske borehull. I borehullspunktene vises metadata (f.eks. boretype, oppdragsfirma, oppdragsgiver, stedfestelse (posisjon), boret dybde (evt. dyp til fjell), rapportnr.). For noen punkter vil mer informasjon være tilgjengelig (f.eks. lenke til rapport og evt. til rådata, boreprofil og måleresultater).
status: Gyldig

Arealstatistikk
type: Concept
in scheme: Produktark
top concept of: Produktark
definition: Dokumentet gir en overordnet presentasjon av produktet Arealstatistikk
description: Dokumentet gir en overordnet presentasjon av produktet Arealstatistikk
status: Gyldig

N250 Kartdata
type: Concept
in scheme: Produktark
top concept of: Produktark
definition: Dokumentet gir en overordnet presentasjon av produktet N250 Kartdatasom er et datasett som er en generalisering av N50 Kartdata og kartografisk tilpasset målestokk 1:100 000 - 1:300 000
description: Dokumentet gir en overordnet presentasjon av produktet N250 Kartdatasom er et datasett som er en generalisering av N50 Kartdata og kartografisk tilpasset målestokk 1:100 000 - 1:300 000
status: Gyldig

IUA (Interkommunalt Utvalg mot Akutt forurensning)
type: Concept
in scheme: Produktark
top concept of: Produktark
definition: Dokumentet gir en overordnet presentasjon av produktet IUA (Interkommunalt Utvalg mot Akutt forurensning). Datasettet inneholder en oversikt over de ulike beredskapsregionene i den kommunale beredskapen, som er samlet under ”Interkommunalt Utvalg mot Akutt forurensing”- IUA.
description: Dokumentet gir en overordnet presentasjon av produktet IUA (Interkommunalt Utvalg mot Akutt forurensning). Datasettet inneholder en oversikt over de ulike beredskapsregionene i den kommunale beredskapen, som er samlet under ”Interkommunalt Utvalg mot Akutt forurensing”- IUA.
status: Gyldig

FKB-Høydekurve
type: Concept
in scheme: Produktark
top concept of: Produktark
definition: Dokumentet gir en overordnet presentasjon av produktet FKB-Høydekurvesom er et datasett som inneholder høydekurver og annen terrengbeskrivende informasjon.
description: Dokumentet gir en overordnet presentasjon av produktet FKB-Høydekurvesom er et datasett som inneholder høydekurver og annen terrengbeskrivende informasjon.
status: Gyldig

IUA - Interkommunale utvalg mot akutt forurensning
type: Concept
in scheme: Produktark
top concept of: Produktark
definition: Dokumentet gir en overordnet presentasjon av produktet.
description: Dokumentet gir en overordnet presentasjon av produktet.
status: Gyldig

Tungmetaller og andre miljøelementer i marine sedimenter
type: Concept
in scheme: Produktark
top concept of: Produktark
definition: Dokumentet gir en overordnet presentasjon av datasettet Tungmetaller og andre miljøelementer i marine sedimenter.
description: Dokumentet gir en overordnet presentasjon av datasettet Tungmetaller og andre miljøelementer i marine sedimenter.
status: Gyldig

Reindrift - Ekspropriasjonsområde
type: Concept
in scheme: Produktark
top concept of: Produktark
definition: Dokumentet gir en overordnet presentasjon av produktet Reindrift Ekspropriasjonsområde, som avgrenser områder som staten har ekspropriert for at det skal kunne utøves reindrift her.
description: Dokumentet gir en overordnet presentasjon av produktet Reindrift Ekspropriasjonsområde, som avgrenser områder som staten har ekspropriert for at det skal kunne utøves reindrift her.
status: Gyldig

FKB-Bygning
type: Concept
in scheme: Produktark
top concept of: Produktark
definition: Dokumentet gir en overordnet presentasjon av produktet FKB-Bygning, som er et datasett som inneholder detaljert bygningsinformasjon
description: Dokumentet gir en overordnet presentasjon av produktet FKB-Bygning, som er et datasett som inneholder detaljert bygningsinformasjon
status: Gyldig

Foreslåtte naturvernområder
type: Concept
in scheme: Produktark
top concept of: Produktark
definition: Dokumentet gir en overordnet presentasjon av produktet Foreslåtte naturvernområder, som er et datasett som viser områder som er under planlegging og sendt på offentlig høring etter lov om Naturmangfold - Kapittel V. Områdevern.
description: Dokumentet gir en overordnet presentasjon av produktet Foreslåtte naturvernområder, som er et datasett som viser områder som er under planlegging og sendt på offentlig høring etter lov om Naturmangfold - Kapittel V. Områdevern.
status: Gyldig

Stranding av plast, modellert sannsynlighet
type: Concept
in scheme: Produktark
top concept of: Produktark
status: Gyldig

Rødlistet natur i verneområder (NiN)
type: Concept
in scheme: Produktark
top concept of: Produktark
status: Gyldig

Arealrepresentativ naturovervåking (ANO)
type: Concept
in scheme: Produktark
top concept of: Produktark
status: Gyldig

Menneskelig påvirkning - Tapte fiskeredskap
type: Concept
in scheme: Produktark
top concept of: Produktark
definition: Punktdata tapte fiskeredskap
description: Punktdata tapte fiskeredskap
status: Gyldig

Rådgivningskart for seismiske og elektromagnetiske undersøkelser
type: Concept
in scheme: Produktark
top concept of: Produktark
definition: Datasettet viser alle områder der HI har definert et råd for geofysiske undersøkelser innenfor gitte tidsperioder.
description: Datasettet viser alle områder der HI har definert et råd for geofysiske undersøkelser innenfor gitte tidsperioder.
status: Gyldig

N1000 Raster
type: Concept
in scheme: Produktark
top concept of: Produktark
definition: Dokumentet gir en overordnet presentasjon av produktet N1000 Raster. N1000 Raster har topografisk informasjon lik N1000 Kartdata.
description: Dokumentet gir en overordnet presentasjon av produktet N1000 Raster. N1000 Raster har topografisk informasjon lik N1000 Kartdata.
status: Gyldig

Sårbare marine bunndyr - observasjonsdata
type: Concept
in scheme: Produktark
top concept of: Produktark
definition: Dokumentet gir en overordnet presentasjon av produktet.
description: Dokumentet gir en overordnet presentasjon av produktet.
status: Gyldig

Stemmekretser - forenklet og tilpasset OGC API - Features
type: Concept
in scheme: Produktark
top concept of: Produktark
status: Sendt inn

Reindrift - Årstidsbeite Vårbeite
type: Concept
in scheme: Produktark
top concept of: Produktark
definition: Dokumentet gir en overordnet presentasjon av produktet «Reindrift - Årstidsbeite Vårbeite». Datasettet vårbeite beskriver beiteområder for rein i vårsesongen og inkluderer også viktig kalvingsland.
description: Dokumentet gir en overordnet presentasjon av produktet «Reindrift - Årstidsbeite Vårbeite». Datasettet vårbeite beskriver beiteområder for rein i vårsesongen og inkluderer også viktig kalvingsland.
status: Gyldig

Forurenset grunn - v2
type: Concept
in scheme: Produktark
top concept of: Produktark
definition: Dokumentet gir en overordnet presentasjon av produktet.
description: Dokumentet gir en overordnet presentasjon av produktet.
status: Gyldig

Steinsprang - aktsomhetsområder
type: Concept
in scheme: Produktark
top concept of: Produktark
definition: Dokumentet gir en overordnet presentasjon av produktet Steinsprang - aktsomhetsområder som er et datasett som viser aktsomhetsområder for steinsprang er en nasjonal kartserie som viser potensielt steinsprangutsatte områder på oversiktsnivå.
description: Dokumentet gir en overordnet presentasjon av produktet Steinsprang - aktsomhetsområder som er et datasett som viser aktsomhetsområder for steinsprang er en nasjonal kartserie som viser potensielt steinsprangutsatte områder på oversiktsnivå.
status: Gyldig

Undersjøiske fjell
type: Concept
in scheme: Produktark
top concept of: Produktark
definition: Dokumentet gir en overordnet presentasjon av datasettet Undersjøiske fjell.
description: Dokumentet gir en overordnet presentasjon av datasettet Undersjøiske fjell.
status: Gyldig

Aktsomhetskart for Jord- og flomskred
type: Concept
in scheme: Produktark
top concept of: Produktark
definition: Dokumentet gir en overordnet beskrivelse av datasettet Aktsomhetskart for jord- og flomskred, som viser potensielle utløpsområder for alle typer løsmasseskred bortsett fra kvikkleireskred og store flomskred i slake elveløp.
description: Dokumentet gir en overordnet beskrivelse av datasettet Aktsomhetskart for jord- og flomskred, som viser potensielle utløpsområder for alle typer løsmasseskred bortsett fra kvikkleireskred og store flomskred i slake elveløp.
status: Gyldig

Grunnkart for arealregnskap (Testversjon 2)
type: Concept
in scheme: Produktark
top concept of: Produktark
definition: Grunnkartet kan testes ut som et et grunnlag for å etablere arealregnskap og kan suppleres med spesifikke data tilpasset ulike regnsapsformål
description: Grunnkartet kan testes ut som et et grunnlag for å etablere arealregnskap og kan suppleres med spesifikke data tilpasset ulike regnsapsformål
status: Sendt inn

Dyrkbar jord
type: Concept
in scheme: Produktark
top concept of: Produktark
definition: Dokumentet gir en overordnet presentasjon av produktet Dyrkbar jord. Datasettet Dyrkbar jord viser arealer som ved oppdyrking kan settes i stand slik at de vil holde kravene til fulldyrka jord og som holder kravene til klima og jordkvalitet for plantedyrking.
description: Dokumentet gir en overordnet presentasjon av produktet Dyrkbar jord. Datasettet Dyrkbar jord viser arealer som ved oppdyrking kan settes i stand slik at de vil holde kravene til fulldyrka jord og som holder kravene til klima og jordkvalitet for plantedyrking.
status: Gyldig

Motorferdsel Svalbard - fartsrestriksjoner fuglefjell
type: Concept
in scheme: Produktark
top concept of: Produktark
status: Gyldig

REGINE
type: Concept
in scheme: Produktark
top concept of: Produktark
definition: Dokumentet gir en overordnet presentasjon av produktet REGINE. REGINE er den nasjonale hydrografiske inndelingen av vassdragene i Norge og dekker landareal og kystarealet så langt ut det finnes øyer.
description: Dokumentet gir en overordnet presentasjon av produktet REGINE. REGINE er den nasjonale hydrografiske inndelingen av vassdragene i Norge og dekker landareal og kystarealet så langt ut det finnes øyer.
status: Gyldig

Grus og pukk
type: Concept
in scheme: Produktark
top concept of: Produktark
definition: Dokumentet gir en overordnet presentasjon av produktet Grus og pukk, som er et datasett som inneholder opplysninger om de aller fleste grus- og pukkforekomster og uttakssteder i Norge for utnyttelse som råstoff for bygge- og anleggsvirksomhet
description: Dokumentet gir en overordnet presentasjon av produktet Grus og pukk, som er et datasett som inneholder opplysninger om de aller fleste grus- og pukkforekomster og uttakssteder i Norge for utnyttelse som råstoff for bygge- og anleggsvirksomhet
status: Gyldig

Støysoner for forsvarets skyte- og øvingsfelt
type: Concept
in scheme: Produktark
top concept of: Produktark
definition: Dokumentet gir en overordnet presentasjon av produktet "Støysoner for forsvarets skyte- og øvingsfelt". Støysonene er ment som et hjelpemiddel i forbindelse med kommunens plan- og byggesaksarbeid.
description: Dokumentet gir en overordnet presentasjon av produktet "Støysoner for forsvarets skyte- og øvingsfelt". Støysonene er ment som et hjelpemiddel i forbindelse med kommunens plan- og byggesaksarbeid.
status: Gyldig

Beitebruk
type: Concept
in scheme: Produktark
top concept of: Produktark
definition: Dokumentet gir en overordnet presentasjon av produktet Beitebruk. Datasettet inneheld informasjon om organiserte beitelag.
description: Dokumentet gir en overordnet presentasjon av produktet Beitebruk. Datasettet inneheld informasjon om organiserte beitelag.
status: Gyldig

BerggrunnN1350
type: Concept
in scheme: Produktark
top concept of: Produktark
definition: Dokumentet gir en overordnet presentasjon av produktet Berggrunn N1350. Berggrunndataene viser utbredelsen av de forskjellige bergarter på jordens overflate.
description: Dokumentet gir en overordnet presentasjon av produktet Berggrunn N1350. Berggrunndataene viser utbredelsen av de forskjellige bergarter på jordens overflate.
status: Gyldig

Datakvalitet på dybdedata i navigasjonsproduktene
type: Concept
in scheme: Produktark
top concept of: Produktark
definition: Datasettet viser hvilken datakvalitet dybdene i norske navigasjonsprodukter har. Datakvalitet sier noe målemetode, posisjoneringsinstrument, dybdenøyaktighet og datadekning i norske farvann.
description: Datasettet viser hvilken datakvalitet dybdene i norske navigasjonsprodukter har. Datakvalitet sier noe målemetode, posisjoneringsinstrument, dybdenøyaktighet og datadekning i norske farvann.
status: Gyldig

Naturtyper - utvalgte
type: Concept
in scheme: Produktark
top concept of: Produktark
status: Gyldig

Dybdedata
type: Concept
in scheme: Produktark
top concept of: Produktark
definition: Dokumentet gir en overordnet presentasjon av produktet "Dybdedata".
description: Dokumentet gir en overordnet presentasjon av produktet "Dybdedata".
status: Gyldig

Eksplosivanlegg
type: Concept
in scheme: Produktark
top concept of: Produktark
definition: Dokumentet gir en overordnet presentasjon av produktet Eksplosivanlegg som er et datasett som viser anlegg med farlig stoff, dvs. brannfarlig og giftig gass, stoff og væske
description: Dokumentet gir en overordnet presentasjon av produktet Eksplosivanlegg som er et datasett som viser anlegg med farlig stoff, dvs. brannfarlig og giftig gass, stoff og væske
status: Gyldig

Sannsynlige forekomster av korallrev
type: Concept
in scheme: Produktark
top concept of: Produktark
definition: Dokumentet gir en overordnet presentasjon av produktet Sannsynlige forekomster av korallrev. Disse dataene omfatter fire datasett, som er et resultat av automatisk klassifisering av høyoppløselige dybdedata. Datasettene viser sannsynlig utbredelse av korallrev. Datasettene dekker deler av Norskehavet fra kysten til eggakanten, fra Aktivneset i sør til Tromsøflaket i nord.
description: Dokumentet gir en overordnet presentasjon av produktet Sannsynlige forekomster av korallrev. Disse dataene omfatter fire datasett, som er et resultat av automatisk klassifisering av høyoppløselige dybdedata. Datasettene viser sannsynlig utbredelse av korallrev. Datasettene dekker deler av Norskehavet fra kysten til eggakanten, fra Aktivneset i sør til Tromsøflaket i nord.
status: Gyldig

AR50
type: Concept
in scheme: Produktark
top concept of: Produktark
definition: Dokumentet gir en overordnet presentasjon av produktet AR50 , som er et datasett som viser kartlag i det landsdekkende datasettet AR50 som viser hovedtyper av arealessurser i målestokk 1:50 000 tilpasset bruk i målestokker fra 1:20 000 til 1:100 000.
description: Dokumentet gir en overordnet presentasjon av produktet AR50 , som er et datasett som viser kartlag i det landsdekkende datasettet AR50 som viser hovedtyper av arealessurser i målestokk 1:50 000 tilpasset bruk i målestokker fra 1:20 000 til 1:100 000.
status: Gyldig

Kulturminner - Lokaliteter, Enkeltminner og Sikringssoner
type: Concept
in scheme: Produktark
top concept of: Produktark
status: Gyldig

Bunnsedimenter (dannelse), oversikt
type: Concept
in scheme: Produktark
top concept of: Produktark
definition: Dokumentet gir en overordnet presentasjon av produktet Bunnsedimenter (dannelse), oversikt og viser bunnsedimenter i havbunnens øvre del (øverste 0-3 m av sjøbunnen), klassifisert etter jordartstype.
description: Dokumentet gir en overordnet presentasjon av produktet Bunnsedimenter (dannelse), oversikt og viser bunnsedimenter i havbunnens øvre del (øverste 0-3 m av sjøbunnen), klassifisert etter jordartstype.
status: Gyldig

FKB-Veg
type: Concept
in scheme: Produktark
top concept of: Produktark
definition: Dokumentet gir en overordnet presentasjon av produktet FKB-Veg, som er et datasett som inneholder gjelder for de enkelte vegelementene som beskriver veglegemets geometri
description: Dokumentet gir en overordnet presentasjon av produktet FKB-Veg, som er et datasett som inneholder gjelder for de enkelte vegelementene som beskriver veglegemets geometri
status: Gyldig

Bunnsedimenter (dannelse), regionalt
type: Concept
in scheme: Produktark
top concept of: Produktark
definition: Dokumentet gir en overordnet presentasjon av produktet Bunnsedimenter (dannelse), regionalt og viser bunnsedimenter i havbunnens øvre del (øverste 0-50 cm av sjøbunnen), klassifisert etter jordartstype.
description: Dokumentet gir en overordnet presentasjon av produktet Bunnsedimenter (dannelse), regionalt og viser bunnsedimenter i havbunnens øvre del (øverste 0-50 cm av sjøbunnen), klassifisert etter jordartstype.
status: Gyldig

Nasjonalt grunnkart for arealanalyse (Testversjon 2)
type: Concept
in scheme: Produktark
top concept of: Produktark
definition: Grunnkartet kan testes ut som et et grunnlag for å etablere arealanalyser og arealregnskap, og det kan suppleres med spesifikke data tilpasset ulike regnsapsformål
description: Grunnkartet kan testes ut som et et grunnlag for å etablere arealanalyser og arealregnskap, og det kan suppleres med spesifikke data tilpasset ulike regnsapsformål
status: Gyldig

Aktsomhetskart svakhetssoner i fjell
type: Concept
in scheme: Produktark
top concept of: Produktark
definition: Dokumentet gir en overordnet presentasjon av produktet Aktsomhetskart svakhetssoner i fjell. Aktsomhetskart svakhetssoner i fjell viser områder hvor det er sannsynlig eller mindre sannsynlig at det forekommer svakhetssoner i fjellet, som er forårsaket av leiromvandling.
description: Dokumentet gir en overordnet presentasjon av produktet Aktsomhetskart svakhetssoner i fjell. Aktsomhetskart svakhetssoner i fjell viser områder hvor det er sannsynlig eller mindre sannsynlig at det forekommer svakhetssoner i fjellet, som er forårsaket av leiromvandling.
status: Gyldig

Befolkningsstatistikk på rutenett
type: Concept
in scheme: Produktark
top concept of: Produktark
definition: Dokumentet gir en overordnet presentasjon av produktet Befolkningsstatistikk på rutenett. Dataene inneholder befolkningsstatistikk
description: Dokumentet gir en overordnet presentasjon av produktet Befolkningsstatistikk på rutenett. Dataene inneholder befolkningsstatistikk
status: Gyldig

Hovedled og biled, arealavgrensning
type: Concept
in scheme: Produktark
top concept of: Produktark
definition: Dokumentet gir en overordnet presentasjon av produktet.
description: Dokumentet gir en overordnet presentasjon av produktet.
status: Gyldig

Marine sedimentasjonsmiljø, regional
type: Concept
in scheme: Produktark
top concept of: Produktark
definition: Dokumentet gir en overordnet presentasjon av produktet marine sedimentasjonsmiljø, regional. Datasettet viser dominerende sedimentasjonsmiljø i kartlagte norske havområder i Norskehavet, Barentshavet og rundt Svalbard.
description: Dokumentet gir en overordnet presentasjon av produktet marine sedimentasjonsmiljø, regional. Datasettet viser dominerende sedimentasjonsmiljø i kartlagte norske havområder i Norskehavet, Barentshavet og rundt Svalbard.
status: Gyldig

Kulturminner – Kulturmiljøer
type: Concept
in scheme: Produktark
top concept of: Produktark
definition: Dokumentet gir en overordnet presentasjon av produktet Kulturminner – kulturmiljøer. Datasettet dekker fredete kulturmiljøer, verdensarv og nasjonale interesser i by.
description: Dokumentet gir en overordnet presentasjon av produktet Kulturminner – kulturmiljøer. Datasettet dekker fredete kulturmiljøer, verdensarv og nasjonale interesser i by.
status: Gyldig

Reindrift - Oppsamlingsområde
type: Concept
in scheme: Produktark
top concept of: Produktark
definition: Dokumentet gir en overordnet presentasjon av produktet Reindrift - Oppsamlingsområde. Oppsamlingsområde er et område med naturlig avgrensning hvor reinen samles midlertidig under innsamling til flytting, kalvemerking, skilling eller slakt.
description: Dokumentet gir en overordnet presentasjon av produktet Reindrift - Oppsamlingsområde. Oppsamlingsområde er et område med naturlig avgrensning hvor reinen samles midlertidig under innsamling til flytting, kalvemerking, skilling eller slakt.
status: Gyldig

Naturtyper - DN-håndbok 19
type: Concept
in scheme: Produktark
top concept of: Produktark
status: Gyldig

AR5forvaltning
type: Concept
in scheme: Produktark
top concept of: Produktark
definition: Dokumentet gir en overordnet presentasjon av produktet AR5forvaltning. AR5 er et detaljert, nasjonalt heldekkende datasett som deler inn landarealet etter arealtype, skog-bonitet, treslag og grunnforhold.
description: Dokumentet gir en overordnet presentasjon av produktet AR5forvaltning. AR5 er et detaljert, nasjonalt heldekkende datasett som deler inn landarealet etter arealtype, skog-bonitet, treslag og grunnforhold.
status: Gyldig

Svamphage, predikert
type: Concept
in scheme: Produktark
top concept of: Produktark
definition: Dokumentet gir en overordnet presentasjon av produktet.
description: Dokumentet gir en overordnet presentasjon av produktet.
status: Gyldig

Søppel pr. Mareano-stasjon
type: Concept
in scheme: Produktark
top concept of: Produktark
definition: Dokumentet gir en overordnet presentasjon av produktet.
description: Dokumentet gir en overordnet presentasjon av produktet.
status: Gyldig

Reindrift - Siidaområde
type: Concept
in scheme: Produktark
top concept of: Produktark
definition: Dokumentet gir en overordnet presentasjon av produktet Siidaområde, som avgrenser siidaer i det samiske reinbeiteområdet.
description: Dokumentet gir en overordnet presentasjon av produktet Siidaområde, som avgrenser siidaer i det samiske reinbeiteområdet.
status: Gyldig

Kulturlandskap - utvalgte
type: Concept
in scheme: Produktark
top concept of: Produktark
definition: Dokumentet gir en overordnet presentasjon av produktet.
description: Dokumentet gir en overordnet presentasjon av produktet.
status: Gyldig

Produktark for datasettet aktsomhetsområder for flom
type: Concept
in scheme: Produktark
top concept of: Produktark
definition: Dokumentet inneholder en kortfattet beskrivelse av datasettet aktsomhetsområder for flom
description: Dokumentet inneholder en kortfattet beskrivelse av datasettet aktsomhetsområder for flom
status: Sendt inn

Arealbruk
type: Concept
in scheme: Produktark
top concept of: Produktark
definition: Dokumentet gir en overordnet presentasjon av datasettet Arealbruk
description: Dokumentet gir en overordnet presentasjon av datasettet Arealbruk
status: Gyldig

Akkumulasjonsrater for organisk karbon i havbunnsedimenter i Nordsjøen og Skagerrak
type: Concept
in scheme: Produktark
top concept of: Produktark
definition: Dokumentet gir en overordnet presentasjon av datasettet "Akkumulasjonsrater for organisk karbon i havbunnsedimenter i Nordsjøen og Skagerrak". Datasettet gir en oversikt over akkumulasjonsrater for organisk karbon i de øverste ti centimeterne av havbunnsedimenter i Nordsjøen og Skagerrak.
description: Dokumentet gir en overordnet presentasjon av datasettet "Akkumulasjonsrater for organisk karbon i havbunnsedimenter i Nordsjøen og Skagerrak". Datasettet gir en oversikt over akkumulasjonsrater for organisk karbon i de øverste ti centimeterne av havbunnsedimenter i Nordsjøen og Skagerrak.
status: Gyldig

Mareano bunnprøvestasjoner
type: Concept
in scheme: Produktark
top concept of: Produktark
definition: Dokumentet gir en overordnet presentasjon av produktet.
description: Dokumentet gir en overordnet presentasjon av produktet.
status: Gyldig

Mareanoprøver - Artsmangfold, individer og biomasse
type: Concept
in scheme: Produktark
top concept of: Produktark
definition: Dokumentet gir en overordnet presentasjon av produktet.
description: Dokumentet gir en overordnet presentasjon av produktet.
status: Gyldig

Marin grense
type: Concept
in scheme: Produktark
top concept of: Produktark
definition: Dokumentet gir en overordnet presentasjon av datasettet Marin grense, som er et datasett som angir det høyeste nivået som havet nådde etter siste istid.
description: Dokumentet gir en overordnet presentasjon av datasettet Marin grense, som er et datasett som angir det høyeste nivået som havet nådde etter siste istid.
status: Gyldig

Store fjellskred
type: Concept
in scheme: Produktark
top concept of: Produktark
definition: Dokumentet gir en overordnet presentasjon av produktet Store fjellskred
description: Dokumentet gir en overordnet presentasjon av produktet Store fjellskred
status: Gyldig

Forurenset grunn
type: Concept
in scheme: Produktark
top concept of: Produktark
definition: Dokumentet gir en overordnet presentasjon av produktet Forurenset grunn som er et datasett som omfatter eiendommer med forurenset grunn samt kommunale og private-/ industrideponier
description: Dokumentet gir en overordnet presentasjon av produktet Forurenset grunn som er et datasett som omfatter eiendommer med forurenset grunn samt kommunale og private-/ industrideponier
status: Gyldig

Matrikkelen - Vegadresse
type: Concept
in scheme: Produktark
top concept of: Produktark
definition: Dokumentet gir en overordnet presentasjon av produktet.
description: Dokumentet gir en overordnet presentasjon av produktet.
status: Gyldig

Vannmasser - Bunnsaltholdighet
type: Concept
in scheme: Produktark
top concept of: Produktark
status: Gyldig

Beredskapsdepot
type: Concept
in scheme: Produktark
top concept of: Produktark
definition: Dokumentet gir en overordnet presentasjon av produktet Beredskapsdepot. Datasettet inneholder oversikt over Kystverkets statlige beredskapsdepot for akutt oljeforurensing som inngår i Kystverkets beredskapsplan.
description: Dokumentet gir en overordnet presentasjon av produktet Beredskapsdepot. Datasettet inneholder oversikt over Kystverkets statlige beredskapsdepot for akutt oljeforurensing som inngår i Kystverkets beredskapsplan.
status: Gyldig

Militære forbudsområder innen sjøforsvaret
type: Concept
in scheme: Produktark
top concept of: Produktark
definition: Dokumentet gir en overordnet presentasjon av produktet.
description: Dokumentet gir en overordnet presentasjon av produktet.
status: Gyldig

Organiske miljøgifter i marine sedimenter
type: Concept
in scheme: Produktark
top concept of: Produktark
definition: Dokumentet gir en overordnet presentasjon av produktet.
description: Dokumentet gir en overordnet presentasjon av produktet.
status: Gyldig

Anadrome laksefisk - Forvaltningsregioner
type: Concept
in scheme: Produktark
top concept of: Produktark
status: Gyldig

Radon aktsomhet
type: Concept
in scheme: Produktark
top concept of: Produktark
definition: Dokumentet gir en overordnet presentasjon av produktet Radon - aktsomhet. Nasjonalt aktsomhetskart for radon viser hvilke områder i Norge som kan være mer radonutsatt enn andre. Datasettet er basert på inneluftmålinger av radon og på kunnskap om geologiske forhold.
description: Dokumentet gir en overordnet presentasjon av produktet Radon - aktsomhet. Nasjonalt aktsomhetskart for radon viser hvilke områder i Norge som kan være mer radonutsatt enn andre. Datasettet er basert på inneluftmålinger av radon og på kunnskap om geologiske forhold.
status: Gyldig

Sikringstiltak
type: Concept
in scheme: Produktark
top concept of: Produktark
definition: Datasettet inneholder sikringstiltak (f.eks. flomsikring, erosjonssikring, skredsikring) utført i regi av NVE, og egenskaper knyttes til disse (f.eks. navn, nr, anleggstype, formål, status). Datasettet består av to kartlag, der det ene kartlaget viser utstrekningen til sikringsanlegg i terrenget, mens det andre kartlaget viser midtpunkt til anleggene. Begge kartlagene inneholder egenskaper tilknyttet anleggene. Datasettet inneholder både planlagte anlegg, og ferdigstilte anlegg.
description: Datasettet inneholder sikringstiltak (f.eks. flomsikring, erosjonssikring, skredsikring) utført i regi av NVE, og egenskaper knyttes til disse (f.eks. navn, nr, anleggstype, formål, status). Datasettet består av to kartlag, der det ene kartlaget viser utstrekningen til sikringsanlegg i terrenget, mens det andre kartlaget viser midtpunkt til anleggene. Begge kartlagene inneholder egenskaper tilknyttet anleggene. Datasettet inneholder både planlagte anlegg, og ferdigstilte anlegg.
status: Gyldig

Snø- og steinskred - aktsomhetsområder
type: Concept
in scheme: Produktark
top concept of: Produktark
definition: Dokumentet gir en overordnet presentasjon av produktet Snø- og steinskred - aktsomhetsområder. Aktsomhetsområdene for snø- og steinskred viser aktsomhetsområder samlet for de to skredtypene.
description: Dokumentet gir en overordnet presentasjon av produktet Snø- og steinskred - aktsomhetsområder. Aktsomhetsområdene for snø- og steinskred viser aktsomhetsområder samlet for de to skredtypene.
status: Tilbaketrukket

Reindrift - Konsesjonsområde
type: Concept
in scheme: Produktark
top concept of: Produktark
definition: Dokumentet gir en overordnet presentasjon av produktet Reindrift - Konsesjonsområde, som avgrenser områder utenfor det samiske reinbeiteområdet der det er gitt en særskilt tillatelse til å utøve reindrift etter reindriftslovens § 8. Dette gjelder både samisk og ikke-samisk reindrift.
description: Dokumentet gir en overordnet presentasjon av produktet Reindrift - Konsesjonsområde, som avgrenser områder utenfor det samiske reinbeiteområdet der det er gitt en særskilt tillatelse til å utøve reindrift etter reindriftslovens § 8. Dette gjelder både samisk og ikke-samisk reindrift.
status: Gyldig

Jordbruksstatistikk på ruter
type: Concept
in scheme: Produktark
top concept of: Produktark
definition: Dokumentet gir en overordnet presentasjon av datasettet jordbruksstatistikk på ruter.
description: Dokumentet gir en overordnet presentasjon av datasettet jordbruksstatistikk på ruter.
status: Gyldig

FKB-Lufthavn
type: Concept
in scheme: Produktark
top concept of: Produktark
definition: Dokumentet gir en overordnet presentasjon av produktet FKB-Lufthavnsom er et datasett som beskriver geografiske data omkring lufthavner, tekniske installasjoner og andre anlegg som er særegent for lufthavn.
description: Dokumentet gir en overordnet presentasjon av produktet FKB-Lufthavnsom er et datasett som beskriver geografiske data omkring lufthavner, tekniske installasjoner og andre anlegg som er særegent for lufthavn.
status: Gyldig

Markslag (Digitalt Markslagskart - DMK)
type: Concept
in scheme: Produktark
top concept of: Produktark
definition: Dokumentet gir en overordnet presentasjon av produktet Markslag (Digitalt Markslagskart - DMK). Digitalt markslagskart (DMK) er erstatta av datasetta FKB-AR5 og FKB Dyrkbar jord og vert ikkje lenger oppdatert.
description: Dokumentet gir en overordnet presentasjon av produktet Markslag (Digitalt Markslagskart - DMK). Digitalt markslagskart (DMK) er erstatta av datasetta FKB-AR5 og FKB Dyrkbar jord og vert ikkje lenger oppdatert.
status: Gyldig

N500 Raster
type: Concept
in scheme: Produktark
top concept of: Produktark
definition: Dokumentet gir en overordnet presentasjon av produktet N500 Raster. N500 Raster har topografisk informasjon lik N500 Kartdata
description: Dokumentet gir en overordnet presentasjon av produktet N500 Raster. N500 Raster har topografisk informasjon lik N500 Kartdata
status: Gyldig

Jordkvalitet
type: Concept
in scheme: Produktark
top concept of: Produktark
definition: Dokumentet gir en overordnet presentasjon av produktet Jordkvalitet, som er et datasett hvor kartlaget jordkvalitet viser en vurdering av jordegenskaper som er viktig for den agronomiske bruken av jorda, samt jordbruksarealets hellingsgrad.
description: Dokumentet gir en overordnet presentasjon av produktet Jordkvalitet, som er et datasett hvor kartlaget jordkvalitet viser en vurdering av jordegenskaper som er viktig for den agronomiske bruken av jorda, samt jordbruksarealets hellingsgrad.
status: Gyldig

Vindkraftverk
type: Concept
in scheme: Produktark
top concept of: Produktark
status: Gyldig

Nasjonale laksefjorder
type: Concept
in scheme: Produktark
top concept of: Produktark
definition: Dokumentet gir en overordnet presentasjon av produktet "Nasjonale laksefjorder".
description: Dokumentet gir en overordnet presentasjon av produktet "Nasjonale laksefjorder".
status: Gyldig

NiN grunntyper og hovedtyper av saltvannssjøbunn, punktobservasjoner
type: Concept
in scheme: Produktark
top concept of: Produktark
definition: Dokumentet gir en overordnet presentasjon av produktet.
description: Dokumentet gir en overordnet presentasjon av produktet.
status: Gyldig

Jernbane - Banenettverk
type: Concept
in scheme: Produktark
top concept of: Produktark
definition: Dokumentet gir en overordnet presentasjon av produktet Jernbane - Banenettverk.
description: Dokumentet gir en overordnet presentasjon av produktet Jernbane - Banenettverk.
status: Gyldig

Matrikkelen - Bygningspunkt
type: Concept
in scheme: Produktark
top concept of: Produktark
definition: Dokumentet gir en overordnet presentasjon av produktet.
description: Dokumentet gir en overordnet presentasjon av produktet.
status: Gyldig

Reindrift - Samebyavtale
type: Concept
in scheme: Produktark
top concept of: Produktark
status: Gyldig

Aktsomhetskart for kvikkleireskred
type: Concept
in scheme: Produktark
top concept of: Produktark
definition: Dokumentet gir en overordnet presentasjon av datasettet Aktsomhetskart for kvikkleireskred
description: Dokumentet gir en overordnet presentasjon av datasettet Aktsomhetskart for kvikkleireskred
status: Gyldig

Naturskog (v1)
type: Concept
in scheme: Produktark
top concept of: Produktark
status: Gyldig

Verneplan for vassdrag
type: Concept
in scheme: Produktark
top concept of: Produktark
definition: Dokumentet gir en overordnet presentasjon av produktet Verneplan for vassdrag, som er en database over vassdrag verna mot kraftutbygging.
description: Dokumentet gir en overordnet presentasjon av produktet Verneplan for vassdrag, som er en database over vassdrag verna mot kraftutbygging.
status: Gyldig

Navigasjonsinstallasjon
type: Concept
in scheme: Produktark
top concept of: Produktark
definition: Dokumentet gir en overordnet presentasjon av produktet.
description: Dokumentet gir en overordnet presentasjon av produktet.
status: Gyldig

Konnekteringspunkter mellom Norge og Finland
type: Concept
in scheme: Produktark
top concept of: Produktark
status: Gyldig

Grunnkart for arealregnskap
type: Concept
in scheme: Produktark
top concept of: Produktark
definition: Grunnkartet kan testes ut som et et grunnlag for å etablere arealregnskap og kan suppleres med spesifikke data tilpasset ulike regnsapsformål
description: Grunnkartet kan testes ut som et et grunnlag for å etablere arealregnskap og kan suppleres med spesifikke data tilpasset ulike regnsapsformål
status: Sendt inn

Bunnsedimenter (kornstørrelse), regionalt
type: Concept
in scheme: Produktark
top concept of: Produktark
definition: Dokumentet gir en overordnet presentasjon av produktet bunnsedimenter (kornstørrelse), regionalt. Dataene viser kornstørrelsessammensetning i sjøbunnsedimentenes øvre del (øverste 0-50 cm av sjøbunnen).
description: Dokumentet gir en overordnet presentasjon av produktet bunnsedimenter (kornstørrelse), regionalt. Dataene viser kornstørrelsessammensetning i sjøbunnsedimentenes øvre del (øverste 0-50 cm av sjøbunnen).
status: Gyldig

Mareano - videostasjoner
type: Concept
in scheme: Produktark
top concept of: Produktark
definition: Dokumentet gir en overordnet presentasjon av produktet.
description: Dokumentet gir en overordnet presentasjon av produktet.
status: Gyldig

Vannkraft, utbygd og ikke utbygd
type: Concept
in scheme: Produktark
top concept of: Produktark
definition: Dokumentet gir en overordnet presentasjon av produktet vannkraft
description: Dokumentet gir en overordnet presentasjon av produktet vannkraft
status: Gyldig

Marine naturtyper (HB19)
type: Concept
in scheme: Produktark
top concept of: Produktark
status: Gyldig

Mareano bunnprøver linjer
type: Concept
in scheme: Produktark
top concept of: Produktark
definition: Dokumentet gir en overordnet presentasjon av produktet.
description: Dokumentet gir en overordnet presentasjon av produktet.
status: Gyldig

Interkommunale brannvesen
type: Concept
in scheme: Produktark
top concept of: Produktark
status: Gyldig

Artsmangfold - Videoobserverte korallbunntyper
type: Concept
in scheme: Produktark
top concept of: Produktark
definition: Dokumentet gir en overordnet presentasjon av produktet.
description: Dokumentet gir en overordnet presentasjon av produktet.
status: Gyldig

FKB-Tiltak
type: Concept
in scheme: Produktark
top concept of: Produktark
definition: Dokumentet gir en overordnet presentasjon av produktet FKB-Tiltak, et datasett som inneholder objekter (områder der det skjer utbygging) som er omsøkt/godkjent gjennom saksbehandling i kommunen eller andre offentlige myndigheter.
description: Dokumentet gir en overordnet presentasjon av produktet FKB-Tiltak, et datasett som inneholder objekter (områder der det skjer utbygging) som er omsøkt/godkjent gjennom saksbehandling i kommunen eller andre offentlige myndigheter.
status: Gyldig

Tilgjengelighet - tettsted
type: Concept
in scheme: Produktark
top concept of: Produktark
definition: Dokumentet gir en overordnet presentasjon av produktet Tilgjengelighet - tettsted.
description: Dokumentet gir en overordnet presentasjon av produktet Tilgjengelighet - tettsted.
status: Gyldig

Nasjonalt register over luftfartshindre (NRL)
type: Concept
in scheme: Produktark
top concept of: Produktark
definition: Dokumentet gir en overordnet presentasjon av produktet Nasjonalt register over luftfartshindre (NRL).
description: Dokumentet gir en overordnet presentasjon av produktet Nasjonalt register over luftfartshindre (NRL).
status: Gyldig

FKB-Ledning
type: Concept
in scheme: Produktark
top concept of: Produktark
definition: Dokumentet gir en overordnet presentasjon av produktet FKB-Ledning, som er et datasett som inneholder ledningsnettet som er synlig på terrengoverflaten
description: Dokumentet gir en overordnet presentasjon av produktet FKB-Ledning, som er et datasett som inneholder ledningsnettet som er synlig på terrengoverflaten
status: Gyldig

Marine landskap
type: Concept
in scheme: Produktark
top concept of: Produktark
definition: Dokumentet gir en detaljert beskrivelse av datasettet "Marine landskap" og er basert på standarden ISO 19131 Data Product Specification
description: Dokumentet gir en detaljert beskrivelse av datasettet "Marine landskap" og er basert på standarden ISO 19131 Data Product Specification
status: Gyldig

Uran aktsomhet
type: Concept
in scheme: Produktark
top concept of: Produktark
definition: Dokumentet gir en overordnet presentasjon av datasettet Uran aktsomhet. Nasjonalt aktsomhetskart for uran viser områder i Norge som kjennetegnes av tilstedeværelsen av uranrike bergarter og/eller løsmasser. Kartet er basert på eksisterende geodatabaser, som inkluderer flybårne radiometriske målinger, geokjemi fra steinprøver og berggrunnsgeologi. Dette gir en omfattende oversikt over fordelingen av uran på nasjonal skala.
description: Dokumentet gir en overordnet presentasjon av datasettet Uran aktsomhet. Nasjonalt aktsomhetskart for uran viser områder i Norge som kjennetegnes av tilstedeværelsen av uranrike bergarter og/eller løsmasser. Kartet er basert på eksisterende geodatabaser, som inkluderer flybårne radiometriske målinger, geokjemi fra steinprøver og berggrunnsgeologi. Dette gir en omfattende oversikt over fordelingen av uran på nasjonal skala.
status: Gyldig

Marine vanntyper
type: Concept
in scheme: Produktark
top concept of: Produktark
definition: Datasettet viser inndeling av kyst- og havområdene i Norge.
description: Datasettet viser inndeling av kyst- og havområdene i Norge.
status: Gyldig

Modellert Havbunnsgeologi WMS
type: Concept
in scheme: Produktark
top concept of: Produktark
definition: Dokumentet gir en overordnet presentasjon av tjenesten Modellert Havbunnsgeologi WMS. Karttjenesten viser modellerte geologiske parametere for marine bunnsedimenter. Den første modelleringen har tatt for seg lagring av organisk karbon i Nordsjøen og Skagerrak. Kartlagene gir en oversikt over sedimentasjonsrater, konsentrasjoner av organisk karbon (OK) og akkumulasjonsrater av organisk karbon i de øverste ti centimeterne av havbunnsedimenter. De tre parameterne er supplert med hver sitt kartlag, som viser usikkerheten i de estimerte verdiene.
description: Dokumentet gir en overordnet presentasjon av tjenesten Modellert Havbunnsgeologi WMS. Karttjenesten viser modellerte geologiske parametere for marine bunnsedimenter. Den første modelleringen har tatt for seg lagring av organisk karbon i Nordsjøen og Skagerrak. Kartlagene gir en oversikt over sedimentasjonsrater, konsentrasjoner av organisk karbon (OK) og akkumulasjonsrater av organisk karbon i de øverste ti centimeterne av havbunnsedimenter. De tre parameterne er supplert med hver sitt kartlag, som viser usikkerheten i de estimerte verdiene.
status: Gyldig

Navn fra sentralt stedsnavnregister
type: Concept
in scheme: Produktark
top concept of: Produktark
status: Gyldig

Snøscooterløyper
type: Concept
in scheme: Produktark
top concept of: Produktark
definition: Dokumentet gir en overordnet presentasjon av produktet.
description: Dokumentet gir en overordnet presentasjon av produktet.
status: Gyldig

Naturtyper på land (NiN)
type: Concept
in scheme: Produktark
top concept of: Produktark
status: Gyldig

Kartlagte og verdsatte friluftslivsområder
type: Concept
in scheme: Produktark
top concept of: Produktark
definition: Dokumentet gir en overordnet presentasjon av produktet Kartlagte og verdsatte friluftslivsområder, som er et datasett som viser områder som er kartlagt og verdsatt etter metodikken i Miljødirektoratets Veileder M98-2013
description: Dokumentet gir en overordnet presentasjon av produktet Kartlagte og verdsatte friluftslivsområder, som er et datasett som viser områder som er kartlagt og verdsatt etter metodikken i Miljødirektoratets Veileder M98-2013
status: Gyldig

Administrative enheter Norge
type: Concept
in scheme: Produktark
top concept of: Produktark
definition: Dokumentet gir en overordnet presentasjon av produktet Administrative enheter Norge, som viser nasjons-, fylkes- og kommuneinndelingen i landet med de mest nøyaktigegrenser som er registrert digitalt og som er samlet i ett datasett.
description: Dokumentet gir en overordnet presentasjon av produktet Administrative enheter Norge, som viser nasjons-, fylkes- og kommuneinndelingen i landet med de mest nøyaktigegrenser som er registrert digitalt og som er samlet i ett datasett.
status: Gyldig

Korallrev - forbudsområder
type: Concept
in scheme: Produktark
top concept of: Produktark
definition: Dokumentet gir en overordnet presentasjon av produktet Korallrev - forbudsområder. Datasettet viser områder hvor det er forbud mot å drive fiske i nærheten av, vedtatt i forskrift om endring av forskrift om utøvelse av fisket i sjøen, §66 annet ledd.
description: Dokumentet gir en overordnet presentasjon av produktet Korallrev - forbudsområder. Datasettet viser områder hvor det er forbud mot å drive fiske i nærheten av, vedtatt i forskrift om endring av forskrift om utøvelse av fisket i sjøen, §66 annet ledd.
status: Gyldig

FKB-Arealbruk
type: Concept
in scheme: Produktark
top concept of: Produktark
definition: Dokumentet gir en overordnet presentasjon av produktet FKB-Arealbruk, som er et datasett som beskriver arealbruk uavhengig av markens produksjonsevne
description: Dokumentet gir en overordnet presentasjon av produktet FKB-Arealbruk, som er et datasett som beskriver arealbruk uavhengig av markens produksjonsevne
status: Gyldig

Sjøkart - raster Overseilingskart (Print on demand)
type: Concept
in scheme: Produktark
top concept of: Produktark
definition: Dokumentet gir en overordnet presentasjon av produktet.
description: Dokumentet gir en overordnet presentasjon av produktet.
status: Gyldig

Motorferdsel Svalbard - regler fastboende og tilreisende
type: Concept
in scheme: Produktark
top concept of: Produktark
status: Gyldig

Breutstrekning for perioden 1999 - 2006
type: Concept
in scheme: Produktark
top concept of: Produktark
definition: Produktark for GAO 1999-2006(Glacier Area Outline)
description: Produktark for GAO 1999-2006(Glacier Area Outline)
status: Gyldig

BerggrunnN50
type: Concept
in scheme: Produktark
top concept of: Produktark
definition: Dokumentet gir en overordnet presentasjon av produktet Berggrunn N50. Berggrunndataene viser utbredelsen av de forskjellige bergarter på jordens overflate.
description: Dokumentet gir en overordnet presentasjon av produktet Berggrunn N50. Berggrunndataene viser utbredelsen av de forskjellige bergarter på jordens overflate.
status: Gyldig

Helling på jordbruksareal
type: Concept
in scheme: Produktark
top concept of: Produktark
definition: Produktarket gir en overordnet presentasjon av produktet Helling - WMS, som viser helling på jordbruksareal.
description: Produktarket gir en overordnet presentasjon av produktet Helling - WMS, som viser helling på jordbruksareal.
status: Gyldig

Bunnsedimenter (kornstørrelse), oversikt
type: Concept
in scheme: Produktark
top concept of: Produktark
definition: Dokumentet gir en overordnet presentasjon av produktet bunnsedimenter (kornstørrelse), oversikt - M 1:750.000. Dataene viser kornstørrelsessammensetning i sjøbunnsedimentenes øvre del (øverste 0-50 cm av sjøbunnen).
description: Dokumentet gir en overordnet presentasjon av produktet bunnsedimenter (kornstørrelse), oversikt - M 1:750.000. Dataene viser kornstørrelsessammensetning i sjøbunnsedimentenes øvre del (øverste 0-50 cm av sjøbunnen).
status: Gyldig

Elvenett - ELVIS
type: Concept
in scheme: Produktark
top concept of: Produktark
definition: Dokumentet gir en overordnet presentasjon av produktet Elvenett - ELVIS. ELVIS er basert på NVEs nasjonale elvenettverksdatabase. I ELVIS er alle vassdragselementer representert som sammenhengende linjer i et nettverk. Nettverket inneholder informasjon om strømningsretning.
description: Dokumentet gir en overordnet presentasjon av produktet Elvenett - ELVIS. ELVIS er basert på NVEs nasjonale elvenettverksdatabase. I ELVIS er alle vassdragselementer representert som sammenhengende linjer i et nettverk. Nettverket inneholder informasjon om strømningsretning.
status: Gyldig

MarinSannsynligeKorallrevWMS
type: Concept
in scheme: Produktark
top concept of: Produktark
definition: Dokumentet gir en overordnet presentasjon av karttjenesten MarinSannsynligeKorallrevWMS. Karttjenesten publiserer seks kartlag, som viser sannsynlige forekomster av korallrev på norsk kontinentalsokkel.
description: Dokumentet gir en overordnet presentasjon av karttjenesten MarinSannsynligeKorallrevWMS. Karttjenesten publiserer seks kartlag, som viser sannsynlige forekomster av korallrev på norsk kontinentalsokkel.
status: Gyldig

Potensielt tilgjengelig strandsone
type: Concept
in scheme: Produktark
top concept of: Produktark
definition: Dokumentet gir en overordnet presentasjon av produktet Potensielt tilgjengelig strandsone. Potensielt tilgjengelige strandsonearealer i strandsonen beregnes ut fra terreng, veistrekninger, jernbanestrekninger, dyrket markarealer, bygninger og kystlinje.
description: Dokumentet gir en overordnet presentasjon av produktet Potensielt tilgjengelig strandsone. Potensielt tilgjengelige strandsonearealer i strandsonen beregnes ut fra terreng, veistrekninger, jernbanestrekninger, dyrket markarealer, bygninger og kystlinje.
status: Gyldig

FKB-Bygningsmessige anlegg
type: Concept
in scheme: Produktark
top concept of: Produktark
definition: Dokumentet gir en overordnet presentasjon av produktet FKB-Bygningsmessige anlegg, som er et datasett som inneholder informasjon om detaljert informasjon om menneskeskapte objekter som ikke er klassifisert som Bygning eller Veg.
description: Dokumentet gir en overordnet presentasjon av produktet FKB-Bygningsmessige anlegg, som er et datasett som inneholder informasjon om detaljert informasjon om menneskeskapte objekter som ikke er klassifisert som Bygning eller Veg.
status: Gyldig

Erosjonsrisiko
type: Concept
in scheme: Produktark
top concept of: Produktark
status: Utkast

N20 Kartdata
type: Concept
in scheme: Produktark
top concept of: Produktark
definition: Dokumentet gir en overordnet presentasjon av produktet N20 Kartdata som er et datasett basert på utvalgte og generaliserte FKB data.
description: Dokumentet gir en overordnet presentasjon av produktet N20 Kartdata som er et datasett basert på utvalgte og generaliserte FKB data.
status: Gyldig

Hovedled og biled
type: Concept
in scheme: Produktark
top concept of: Produktark
definition: Dokumentet gir en overordnet presentasjon av produktet Hovedled og biled. Farledsstrukturen omfatter nettverket av sjøverts transportårer og er et nasjonalt geografisk referansesystem for tiltak innen forvaltning, planlegging, utbygging og operativ virksomhet i kystsonen.
description: Dokumentet gir en overordnet presentasjon av produktet Hovedled og biled. Farledsstrukturen omfatter nettverket av sjøverts transportårer og er et nasjonalt geografisk referansesystem for tiltak innen forvaltning, planlegging, utbygging og operativ virksomhet i kystsonen.
status: Gyldig

Matrikkelen - Norges offisielle eiendomsregister
type: Concept
in scheme: Produktark
top concept of: Produktark
definition: Dokumentet gir en overordnet presentasjon av produktet.
description: Dokumentet gir en overordnet presentasjon av produktet.
status: Gyldig

Barnetråkk - fullstendig
type: Concept
in scheme: Produktark
top concept of: Produktark
definition: Dokumentet gir en overordnet presentasjon av produktet.
description: Dokumentet gir en overordnet presentasjon av produktet.
status: Gyldig

Naturtyper etter NiN Marine Bunnsystemer (NA-M) i målestokk 1:20 000
type: Concept
in scheme: Produktark
top concept of: Produktark
definition: Datasettet viser en klassifisering av kystnære havbunnsarealer i Natur i Norge (NiN) sitt naturtypersystem Marine Bunnsystemer (NA-M).
description: Datasettet viser en klassifisering av kystnære havbunnsarealer i Natur i Norge (NiN) sitt naturtypersystem Marine Bunnsystemer (NA-M).
status: Gyldig

Kvikkleire
type: Concept
in scheme: Produktark
top concept of: Produktark
definition: Dokumentet gir en overordnet presentasjon av produktet Kvikkleire, som er et datasett som gir en oversikt over soner med potensiell fare (aktsomhetsområder) for større kvikkleireskred
description: Dokumentet gir en overordnet presentasjon av produktet Kvikkleire, som er et datasett som gir en oversikt over soner med potensiell fare (aktsomhetsområder) for større kvikkleireskred
status: Gyldig

Referansedata - Videostasjoner
type: Concept
in scheme: Produktark
top concept of: Produktark
status: Gyldig

Naturtyper - Miljødirektoratets instruks
type: Concept
in scheme: Produktark
top concept of: Produktark
status: Gyldig

Sjøkart vektor
type: Concept
in scheme: Produktark
top concept of: Produktark
definition: Kartene er digitale versjoner i vektor form av Norges offisielle sjøkart fra: • Hovedkartserien • Havnekartserien • Overseilingskartserien • Hovedkartserien Svalbard, Jan Mayen, Bouvetøya. • Kystkartserien Kartene er grunnlaget for de trykte papirkartene.
description: Kartene er digitale versjoner i vektor form av Norges offisielle sjøkart fra: • Hovedkartserien • Havnekartserien • Overseilingskartserien • Hovedkartserien Svalbard, Jan Mayen, Bouvetøya. • Kystkartserien Kartene er grunnlaget for de trykte papirkartene.
status: Gyldig

N100 Raster
type: Concept
in scheme: Produktark
top concept of: Produktark
definition: Dokumentet gir en overordnet presentasjon av produktet.
description: Dokumentet gir en overordnet presentasjon av produktet.
status: Gyldig

Menneskelig påvirkning -Trålspor per videotransekt
type: Concept
in scheme: Produktark
top concept of: Produktark
definition: Menneskelig påvirkning -Trålspor per videotransekt (punktdata)
description: Menneskelig påvirkning -Trålspor per videotransekt (punktdata)
status: Gyldig

DTM 50
type: Concept
in scheme: Produktark
top concept of: Produktark
definition: Dokumentet gir en overordnet presentasjon av produktet "DTM 50" som er en digital terrengmodell med høyder i et rutenett på 50 x 50 meter.
description: Dokumentet gir en overordnet presentasjon av produktet "DTM 50" som er en digital terrengmodell med høyder i et rutenett på 50 x 50 meter.
status: Gyldig

Sentrumssoner
type: Concept
in scheme: Produktark
top concept of: Produktark
definition: Dokumentet gir en overordnet presentasjon av produktet Sentrumssoner. En sentrumssone er et område som består av en eller flere sentrumskjerner og ei sone på 100 meter rundt.
description: Dokumentet gir en overordnet presentasjon av produktet Sentrumssoner. En sentrumssone er et område som består av en eller flere sentrumskjerner og ei sone på 100 meter rundt.
status: Gyldig

Konsentrasjon av organisk karbon i havbunnsedimenter i Nordsjøen og Skagerrak
type: Concept
in scheme: Produktark
top concept of: Produktark
definition: Dokumentet gir en overordnet presentasjon av datasettet "Konsentrasjon av organisk karbon i havbunnsedimenter i Nordsjøen og Skagerrak". Datasettet gir en oversikt over konsentrasjonen av organisk karbon i de øverste ti centimeterne av havbunnsedimenter i Nordsjøen og Skagerrak.
description: Dokumentet gir en overordnet presentasjon av datasettet "Konsentrasjon av organisk karbon i havbunnsedimenter i Nordsjøen og Skagerrak". Datasettet gir en oversikt over konsentrasjonen av organisk karbon i de øverste ti centimeterne av havbunnsedimenter i Nordsjøen og Skagerrak.
status: Gyldig

Vernskog
type: Concept
in scheme: Produktark
top concept of: Produktark
definition: Dokumentet gir en overordnet presentasjon av produktet Vernskog. Datasettet viser grenser for skog som anses som tjener til vern for annen skog eller gir vern mot naturskader fordi den står opp mot fjellet eller ut mot havet.
description: Dokumentet gir en overordnet presentasjon av produktet Vernskog. Datasettet viser grenser for skog som anses som tjener til vern for annen skog eller gir vern mot naturskader fordi den står opp mot fjellet eller ut mot havet.
status: Gyldig

N2000 Kartdata
type: Concept
in scheme: Produktark
top concept of: Produktark
definition: Dokumentet gir en overordnet presentasjon av produktet N2000 Kartdata. N2000 kartdata er kartografisk redigert og tilpasset presentasjon i målestokk 1: 2 000 000
description: Dokumentet gir en overordnet presentasjon av produktet N2000 Kartdata. N2000 kartdata er kartografisk redigert og tilpasset presentasjon i målestokk 1: 2 000 000
status: Gyldig

BerggrunnN250
type: Concept
in scheme: Produktark
top concept of: Produktark
definition: Dokumentet gir en overordnet presentasjon av produktet Berggrunn N250. Berggrunndataene viser utbredelsen av de forskjellige bergarter på jordens overflate.
description: Dokumentet gir en overordnet presentasjon av produktet Berggrunn N250. Berggrunndataene viser utbredelsen av de forskjellige bergarter på jordens overflate.
status: Gyldig

Artsutbredelse Fisk
type: Concept
in scheme: Produktark
top concept of: Produktark
status: Gyldig

Bunnfellingsområder
type: Concept
in scheme: Produktark
top concept of: Produktark
definition: Dokumentet gir en overordnet presentasjon av produktet Bunnfellingsområder. Bunnfellingsområder er naturlige forsenkninger på sjøbunnen med meget svake bunnstrømmer og fine sedimenter (silt og leire).
description: Dokumentet gir en overordnet presentasjon av produktet Bunnfellingsområder. Bunnfellingsområder er naturlige forsenkninger på sjøbunnen med meget svake bunnstrømmer og fine sedimenter (silt og leire).
status: Gyldig

Reindrift - Årstidsbeite - Vinterbeite
type: Concept
in scheme: Produktark
top concept of: Produktark
definition: Dokumentet gir en overordnet presentasjon av produktet Reindrift - Årstidsbeite - Vinterbeite
description: Dokumentet gir en overordnet presentasjon av produktet Reindrift - Årstidsbeite - Vinterbeite
status: Gyldig

Vannforekomster
type: Concept
in scheme: Produktark
top concept of: Produktark
definition: Dokumentet gir en overordnet beskrivelse av datasettet vannforekomster
description: Dokumentet gir en overordnet beskrivelse av datasettet vannforekomster
status: Gyldig

FKB-Grønnstruktur
type: Concept
in scheme: Produktark
top concept of: Produktark
definition: Dokumentet gir en overordnet presentasjon av produktet FKB-Grønnstruktur
description: Dokumentet gir en overordnet presentasjon av produktet FKB-Grønnstruktur
status: Gyldig

Reindrift - Årstidsbeite - Høstbeite
type: Concept
in scheme: Produktark
top concept of: Produktark
definition: Dokumentet gir en overordnet presentasjon av produktet Reindrift - årsbeite - Høstbeite. Datasettet beskriver beiteområder for rein i høstsesongen.
description: Dokumentet gir en overordnet presentasjon av produktet Reindrift - årsbeite - Høstbeite. Datasettet beskriver beiteområder for rein i høstsesongen.
status: Gyldig

Flom aktsomhetsområder
type: Concept
in scheme: Produktark
top concept of: Produktark
definition: Dokumentet gir en overordnet presentasjon av produktet Flom aktsomhetsområder
description: Dokumentet gir en overordnet presentasjon av produktet Flom aktsomhetsområder
status: Gyldig

Matrikkelen - Eiendomskart Teig
type: Concept
in scheme: Produktark
top concept of: Produktark
definition: Dokumentet gir en overordnet presentasjon av produktet.
description: Dokumentet gir en overordnet presentasjon av produktet.
status: Gyldig

Artsutbredelse andre marine arter
type: Concept
in scheme: Produktark
top concept of: Produktark
status: Sendt inn

N5 Kartdata
type: Concept
in scheme: Produktark
top concept of: Produktark
definition: Dokumentet gir en overordnet presentasjon av produktet N5 Kartdata, som er et datasett som har Informasjon tilsvarende digitalt ØK. N5 Kartdata er basert på utvalgte, generaliserte FKB data.
description: Dokumentet gir en overordnet presentasjon av produktet N5 Kartdata, som er et datasett som har Informasjon tilsvarende digitalt ØK. N5 Kartdata er basert på utvalgte, generaliserte FKB data.
status: Gyldig

Offentlige grøntområder
type: Concept
in scheme: Produktark
top concept of: Produktark
definition: Dokumentet gir en overordnet presentasjon av produktet Offentlige grøntområder. Polygondata over offentlige grøntområder innenfor tettsteder. Datasettet er basert på FKB-grønnstruktur, men begrenset til "det offentlige" i tettstedene.
description: Dokumentet gir en overordnet presentasjon av produktet Offentlige grøntområder. Polygondata over offentlige grøntområder innenfor tettsteder. Datasettet er basert på FKB-grønnstruktur, men begrenset til "det offentlige" i tettstedene.
status: Gyldig

Snøskred - aktsomhetsområder
type: Concept
in scheme: Produktark
top concept of: Produktark
definition: Dette datasettet er erstattet av Aktsomhetskart for snøskred med produktark https://register.geonorge.no/tegneregler/aktsomhetskart-for-snøskred/. Dokumentet gir en overordnet presentasjon av produktet Snøskred - aktsomhetsområder, som er et datasett som er aktsomhetsområder for snøskred er en nasjonal kartserie som viser potensielt snøskredutsatte områder (aktsomhetsområder) på oversiktsnivå.
description: Dette datasettet er erstattet av Aktsomhetskart for snøskred med produktark https://register.geonorge.no/tegneregler/aktsomhetskart-for-snøskred/. Dokumentet gir en overordnet presentasjon av produktet Snøskred - aktsomhetsområder, som er et datasett som er aktsomhetsområder for snøskred er en nasjonal kartserie som viser potensielt snøskredutsatte områder (aktsomhetsområder) på oversiktsnivå.
status: Tilbaketrukket

Berggrunn N50
type: Concept
in scheme: Produktark
top concept of: Produktark
definition: Dokumentet gir en overordnet presentasjon av produktet Berggrunn N50. Berggrunndataene viser utbredelsen av de forskjellige bergarter på jordens overflate. Datasettet består av polygoner/flater og grenser.
description: Dokumentet gir en overordnet presentasjon av produktet Berggrunn N50. Berggrunndataene viser utbredelsen av de forskjellige bergarter på jordens overflate. Datasettet består av polygoner/flater og grenser.
status: Tilbaketrukket

Kulturminner – fredete bygninger
type: Concept
in scheme: Produktark
top concept of: Produktark
definition: Dokumentet gir en overordnet presentasjon av produktet Kulturminner – fredete bygninger. Datasettet viser bygninger og kirker som er automatisk, vedtaks-, forskrifts- eller midlertidig fredet etter lov og kirker som har status som listeførte.
description: Dokumentet gir en overordnet presentasjon av produktet Kulturminner – fredete bygninger. Datasettet viser bygninger og kirker som er automatisk, vedtaks-, forskrifts- eller midlertidig fredet etter lov og kirker som har status som listeførte.
status: Gyldig

AR250
type: Concept
in scheme: Produktark
top concept of: Produktark
definition: Dokumentet gir en overordnet presentasjon av produktet AR250. AR250 er et heldekkende datasett som viser landets arealressurser på region og fylkesnivå.
description: Dokumentet gir en overordnet presentasjon av produktet AR250. AR250 er et heldekkende datasett som viser landets arealressurser på region og fylkesnivå.
status: Gyldig

Mareano bunnprøver punkt
type: Concept
in scheme: Produktark
top concept of: Produktark
definition: Dokumentet gir en overordnet presentasjon av produktet.
description: Dokumentet gir en overordnet presentasjon av produktet.
status: Gyldig

Ankringsområder
type: Concept
in scheme: Produktark
top concept of: Produktark
definition: Dokumentet gir en overordnet presentasjon av produktet Ankringsområder.Ankringsområde omfatter selve området som beslaglegges av skip til ankers, og
description: Dokumentet gir en overordnet presentasjon av produktet Ankringsområder.Ankringsområde omfatter selve området som beslaglegges av skip til ankers, og
status: Gyldig

Havnedata
type: Concept
in scheme: Produktark
top concept of: Produktark
definition: Dokumentet gir en overordnet presentasjon av produktet Havnedata
description: Dokumentet gir en overordnet presentasjon av produktet Havnedata
status: Gyldig

Dybdedata i Oslofjorden - terrengmodell - 1-m-grid
type: Concept
in scheme: Produktark
top concept of: Produktark
definition: Produktark
description: Produktark
status: Gyldig

FKB-Servitutt
type: Concept
in scheme: Produktark
top concept of: Produktark
definition: Dokumentet gir en overordnet presentasjon av produktet FKB-Servitutt. FKB-Servitutt kan inneholde rettigheter til eiendom som ikke skal registreres i Matrikkelen.
description: Dokumentet gir en overordnet presentasjon av produktet FKB-Servitutt. FKB-Servitutt kan inneholde rettigheter til eiendom som ikke skal registreres i Matrikkelen.
status: Tilbaketrukket

FKB-AR5
type: Concept
in scheme: Produktark
top concept of: Produktark
definition: Dokumentet gir en overordnet presentasjon av produktet FKB-AR5, som er et datasett som beskriver Norges arealressurser i målestokk 1:1 000 og oppover. AR5 vil danne grunnlag for videre ajourhold av detaljert arealressursinformasjon
description: Dokumentet gir en overordnet presentasjon av produktet FKB-AR5, som er et datasett som beskriver Norges arealressurser i målestokk 1:1 000 og oppover. AR5 vil danne grunnlag for videre ajourhold av detaljert arealressursinformasjon
status: Gyldig

Statlige planretningslinjer for differensiert forvaltning av strandsonen langs sjøen
type: Concept
in scheme: Produktark
top concept of: Produktark
definition: Dokumentet gir en overordnet presentasjon av produktet Statlige planretningslinjer for differensiert forvaltning av strandsonen langs sjøen
description: Dokumentet gir en overordnet presentasjon av produktet Statlige planretningslinjer for differensiert forvaltning av strandsonen langs sjøen
status: Gyldig

Bentisk sekundærproduksjon
type: Concept
in scheme: Produktark
top concept of: Produktark
status: Sendt inn

Vannmasser - Overflatestrøm
type: Concept
in scheme: Produktark
top concept of: Produktark
definition: Dokumentet gir en overordnet presentasjon av produktet.
description: Dokumentet gir en overordnet presentasjon av produktet.
status: Gyldig

Kartleggingsenheter NiN
type: Concept
in scheme: Produktark
top concept of: Produktark
status: Gyldig

Kart over grå arealer
type: Concept
in scheme: Produktark
top concept of: Produktark
definition: Dokumentet gir en overordnet presentasjon av produktet Kart over grå arealer
description: Dokumentet gir en overordnet presentasjon av produktet Kart over grå arealer
status: Gyldig

Reindrift - Reinbeiteområde
type: Concept
in scheme: Produktark
top concept of: Produktark
definition: Dokumentet gir en overordnet presentasjon av produktet Reinbeiteområde, som avgrenser de seks reinbeiteområdene som tilsammen utgjør det samiske reinbeite-området.
description: Dokumentet gir en overordnet presentasjon av produktet Reinbeiteområde, som avgrenser de seks reinbeiteområdene som tilsammen utgjør det samiske reinbeite-området.
status: Gyldig

Artsutbredelse Sjøpattedyr
type: Concept
in scheme: Produktark
top concept of: Produktark
status: Sendt inn

Reindrift - Restriksjonsområde
type: Concept
in scheme: Produktark
top concept of: Produktark
definition: Dokumentet gir en overordnet presentasjon av produktet Reindrift - Restriksjonsområde, som avgrenser områder innenfor det samiske reinbeiteområdet hvor retten til å drive reindrift er begrenset på grunn av særlige rettsforhold.
description: Dokumentet gir en overordnet presentasjon av produktet Reindrift - Restriksjonsområde, som avgrenser områder innenfor det samiske reinbeiteområdet hvor retten til å drive reindrift er begrenset på grunn av særlige rettsforhold.
status: Gyldig

Reindrift - Reinbeitedistrikt
type: Concept
in scheme: Produktark
top concept of: Produktark
definition: Dokumentet gir en overordnet presentasjon av produktet Reinbeitedistrikt, som avgrenser reinbeitedistriktene i det samiske reinbeiteområdet.
description: Dokumentet gir en overordnet presentasjon av produktet Reinbeitedistrikt, som avgrenser reinbeitedistriktene i det samiske reinbeiteområdet.
status: Gyldig

Artsmangfold – Svampobservasjoner per videotransekt
type: Concept
in scheme: Produktark
top concept of: Produktark
definition: Dokumentet gir en overordnet presentasjon av produktet.
description: Dokumentet gir en overordnet presentasjon av produktet.
status: Gyldig

NiN grunntyper og hovedtyper av saltvannssjøbunn - predikert
type: Concept
in scheme: Produktark
top concept of: Produktark
definition: Dokumentet gir en overordnet presentasjon av produktet.
description: Dokumentet gir en overordnet presentasjon av produktet.
status: Gyldig

Sjøfjærbunn predikert
type: Concept
in scheme: Produktark
top concept of: Produktark
definition: Dokumentet gir en overordnet presentasjon av produktet.
description: Dokumentet gir en overordnet presentasjon av produktet.
status: Gyldig

Reindrift - Avtaleområde
type: Concept
in scheme: Produktark
top concept of: Produktark
definition: Dokumentet gir en overordnet presentasjon av produktet Reindrift Avtaleområde, som avgrenser områder hvor det i utgangs-punktet ikke er reinbeiterettigheter, men hvor det er inngått avtale om reinbeite mellom grunneier og reindriftsutøver.
description: Dokumentet gir en overordnet presentasjon av produktet Reindrift Avtaleområde, som avgrenser områder hvor det i utgangs-punktet ikke er reinbeiterettigheter, men hvor det er inngått avtale om reinbeite mellom grunneier og reindriftsutøver.
status: Gyldig

Turrutebasen
type: Concept
in scheme: Produktark
top concept of: Produktark
definition: Dokumentet gir en overordnet presentasjon av produktet Tur- og friluftsruter, som er et landsdekkende datasett som viser tur- og friluftsruter i Norge.
description: Dokumentet gir en overordnet presentasjon av produktet Tur- og friluftsruter, som er et landsdekkende datasett som viser tur- og friluftsruter i Norge.
status: Gyldig

Kulturlandskap - verdifulle
type: Concept
in scheme: Produktark
top concept of: Produktark
definition: Dokumentet gir en overordnet presentasjon av produktet.
description: Dokumentet gir en overordnet presentasjon av produktet.
status: Gyldig

Vannmasser - Bølgeeksponering mot sjøbunn
type: Concept
in scheme: Produktark
top concept of: Produktark
definition: Dokumentet gir en overordnet presentasjon av produktet.
description: Dokumentet gir en overordnet presentasjon av produktet.
status: Gyldig

Bunnsedimenter (dannelse), detaljert
type: Concept
in scheme: Produktark
top concept of: Produktark
definition: Dokumentet gir en overordnet presentasjon av produktet bunnsedimenter (dannelse), detaljert og viser bunnsedimenter i havbunnens øvre del, klassifisert etter jordartstype.
description: Dokumentet gir en overordnet presentasjon av produktet bunnsedimenter (dannelse), detaljert og viser bunnsedimenter i havbunnens øvre del, klassifisert etter jordartstype.
status: Gyldig

Reindrift - Reindriftsanlegg
type: Concept
in scheme: Produktark
top concept of: Produktark
definition: Dokumentet gir en overordnet presentasjon av produktet Reindriftsanlegg. Datasettet viser ulike typer anlegg og gjerder som er viktige for reindrifta, f.eks. vises permanente og midlertidige sperregjerder, barmarksløyper,gjeterhytter, feltslakteanlegg og områder for båttransport av rein.
description: Dokumentet gir en overordnet presentasjon av produktet Reindriftsanlegg. Datasettet viser ulike typer anlegg og gjerder som er viktige for reindrifta, f.eks. vises permanente og midlertidige sperregjerder, barmarksløyper,gjeterhytter, feltslakteanlegg og områder for båttransport av rein.
status: Gyldig

Landformer - Miljødirektoratets instruks
type: Concept
in scheme: Produktark
top concept of: Produktark
status: Gyldig

Trålspor
type: Concept
in scheme: Produktark
top concept of: Produktark
definition: Dokumentet gir en overordnet presentasjon av produktet.
description: Dokumentet gir en overordnet presentasjon av produktet.
status: Gyldig

N5 presentasjonsdata
type: Concept
in scheme: Produktark
top concept of: Produktark
definition: Dokumentet gir en overordnet presentasjon av produktet.
description: Dokumentet gir en overordnet presentasjon av produktet.
status: Gyldig

ISPSHavneanlegg
type: Concept
in scheme: Produktark
top concept of: Produktark
definition: Dokumentet gir en overordnet presentasjon av produktet ISPSHavneanlegg. Datasettet inneholder beskrivelse av havneanlegg som Kystverkets fører tilsyn med etter den såkalte ISPS koden.
description: Dokumentet gir en overordnet presentasjon av produktet ISPSHavneanlegg. Datasettet inneholder beskrivelse av havneanlegg som Kystverkets fører tilsyn med etter den såkalte ISPS koden.
status: Gyldig

Tilgjengelighet - friluft
type: Concept
in scheme: Produktark
top concept of: Produktark
definition: Dokumentet gir en overordnet presentasjon av produktet Tilgjengelighet - friluft.
description: Dokumentet gir en overordnet presentasjon av produktet Tilgjengelighet - friluft.
status: Gyldig

FKB-TraktorvegSti
type: Concept
in scheme: Produktark
top concept of: Produktark
definition: Dokumentet gir en overordnet presentasjon av produktet FKB-TraktorvegSti, som er et datasett som inneholder senterlinjegeometri for traktorveger, gangveger, stier og andre typer samferdselsnettverk som ikke forvaltes i NVDB/FKB-Vegnett
description: Dokumentet gir en overordnet presentasjon av produktet FKB-TraktorvegSti, som er et datasett som inneholder senterlinjegeometri for traktorveger, gangveger, stier og andre typer samferdselsnettverk som ikke forvaltes i NVDB/FKB-Vegnett
status: Gyldig

Kulturminner – Verneverdig tette trehusmiljøer
type: Concept
in scheme: Produktark
top concept of: Produktark
definition: Dokumentet gir en overordnet presentasjon av produktet Verneverdig tette trehusmiljøer. Datasettet dekker områder som Riksantikvaren definerer som verneverdig tette trehusmiljøer. Kulturhistorisk verneverdige tette trehusmiljøer der det må tas særskilte brannvernhensyn.
description: Dokumentet gir en overordnet presentasjon av produktet Verneverdig tette trehusmiljøer. Datasettet dekker områder som Riksantikvaren definerer som verneverdig tette trehusmiljøer. Kulturhistorisk verneverdige tette trehusmiljøer der det må tas særskilte brannvernhensyn.
status: Gyldig

Kulturminner - Sikringssoner
type: Concept
in scheme: Produktark
top concept of: Produktark
definition: Dokumentet gir en overordnet presentasjon av produktet Kulturminner - sikringssoner. Datasettet viser sikringssoner rundt automatisk fredeet kulturminner som nevnt i Kulturminnelovens § 4.
description: Dokumentet gir en overordnet presentasjon av produktet Kulturminner - sikringssoner. Datasettet viser sikringssoner rundt automatisk fredeet kulturminner som nevnt i Kulturminnelovens § 4.
status: Gyldig

Fiskeplasser - redskap
type: Concept
in scheme: Produktark
top concept of: Produktark
definition: Dokumentet gir en overordnet presentasjon av produktet Fiskeplasser - redskap.
description: Dokumentet gir en overordnet presentasjon av produktet Fiskeplasser - redskap.
status: Gyldig

NorKyst-800 Gjennomsnittlig saltholdighet
type: Concept
in scheme: Produktark
top concept of: Produktark
status: Sendt inn

Landformer NGU
type: Concept
in scheme: Produktark
top concept of: Produktark
definition: Dokumentet gir en overordnet presentasjon av produktet Landformer. Datasettet viser landformer, geotopverdi og dekning.
description: Dokumentet gir en overordnet presentasjon av produktet Landformer. Datasettet viser landformer, geotopverdi og dekning.
status: Gyldig

Relativ bunnhardhet
type: Concept
in scheme: Produktark
top concept of: Produktark
definition: Dokumentet gir en overordnet presentasjon av produktet Relativ bunnhardhet. Relativ bunnhardhet (Bunnreflektivitet) fra multistråleekkolodd gir informasjon om variasjon i bunntype.
description: Dokumentet gir en overordnet presentasjon av produktet Relativ bunnhardhet. Relativ bunnhardhet (Bunnreflektivitet) fra multistråleekkolodd gir informasjon om variasjon i bunntype.
status: Gyldig

Helling
type: Concept
in scheme: Produktark
top concept of: Produktark
definition: Dokumentet gir en overordnet presentasjon av produktet Helling. WMS-tjenesten viser helling på jordbruksareal.
description: Dokumentet gir en overordnet presentasjon av produktet Helling. WMS-tjenesten viser helling på jordbruksareal.
status: Gyldig

Ultramafiske bergarter
type: Concept
in scheme: Produktark
top concept of: Produktark
definition: Dokumentet gir en detaljert beskrivelse av 'Ultramafiske bergarter', som er svært jern-magnesiumrike bergarter som er dannet dypt nede i jordskorpa eller i mantelen.
description: Dokumentet gir en detaljert beskrivelse av 'Ultramafiske bergarter', som er svært jern-magnesiumrike bergarter som er dannet dypt nede i jordskorpa eller i mantelen.
status: Gyldig

Trua arter - kartleggingsbehov
type: Concept
in scheme: Produktark
top concept of: Produktark
status: Gyldig

Natur i verneområder (NiN)
type: Concept
in scheme: Produktark
top concept of: Produktark
status: Gyldig

Dybdekurver
type: Concept
in scheme: Produktark
top concept of: Produktark
definition: Generaliserte dybdekurver for norske kyst- og havområder. Dybdekurvene er generert fra sammenstilte grid med oppløsning 300m, 600m og 1000m, basert på data fra Kartverket sjødivisjonen, fiskeridatabasen, IBCAO og GEBCO.
description: Generaliserte dybdekurver for norske kyst- og havområder. Dybdekurvene er generert fra sammenstilte grid med oppløsning 300m, 600m og 1000m, basert på data fra Kartverket sjødivisjonen, fiskeridatabasen, IBCAO og GEBCO.
status: Gyldig

Reindrift - Årstidsbeite - Sommerbeite
type: Concept
in scheme: Produktark
top concept of: Produktark
definition: Dokumentet gir en overordnet prensentasjon av produktet Reindrift - Årstidsbeite - sommerbeite. Datasettet sommerbeite beskriver beiteområder for rein i sommersesongen.
description: Dokumentet gir en overordnet prensentasjon av produktet Reindrift - Årstidsbeite - sommerbeite. Datasettet sommerbeite beskriver beiteområder for rein i sommersesongen.
status: Gyldig

Artsmangfold – Videoobservasjoner
type: Concept
in scheme: Produktark
top concept of: Produktark
definition: Dokumentet gir en overordnet presentasjon av produktet.
description: Dokumentet gir en overordnet presentasjon av produktet.
status: Gyldig

Jordsmonn
type: Concept
in scheme: Produktark
top concept of: Produktark
definition: Dokumentet gir en overordnet presentasjon av produktet Jordsmonn. Dataene innholder jordsmonn for å dokumentere egenskaper ved fulldyrka og overflatedyrka jord etter standardiserte, internasjonale metoder.
description: Dokumentet gir en overordnet presentasjon av produktet Jordsmonn. Dataene innholder jordsmonn for å dokumentere egenskaper ved fulldyrka og overflatedyrka jord etter standardiserte, internasjonale metoder.
status: Gyldig

Mulighet for marin leire
type: Concept
in scheme: Produktark
top concept of: Produktark
definition: Mulighet for marin leire er basert på løsmassekart i ulik målestokk og datasett for marin grense. Løsmassetyper under marin grense er klassifisert etter muligheten for å finne marin leire og kan grovt sett inndeles i seks klasser.
description: Mulighet for marin leire er basert på løsmassekart i ulik målestokk og datasett for marin grense. Løsmassetyper under marin grense er klassifisert etter muligheten for å finne marin leire og kan grovt sett inndeles i seks klasser.
status: Gyldig

Dyrkingspotensial
type: Concept
in scheme: Produktark
top concept of: Produktark
status: Gyldig

Låssettingsplasser
type: Concept
in scheme: Produktark
top concept of: Produktark
definition: Dokumentet gir en overordnet presentasjon av produktet Låssettingsplasser.
description: Dokumentet gir en overordnet presentasjon av produktet Låssettingsplasser.
status: Gyldig

N5 raster
type: Concept
in scheme: Produktark
top concept of: Produktark
definition: Dokumentet gir en overordnet presentasjon av produktet N5 raster, som er et datasett som er lik kartene i Økonomisk kartverk. Symboler, linjer og tekst med samme form som på kartene
description: Dokumentet gir en overordnet presentasjon av produktet N5 raster, som er et datasett som er lik kartene i Økonomisk kartverk. Symboler, linjer og tekst med samme form som på kartene
status: Gyldig

Skredfaresoner
type: Concept
in scheme: Produktark
top concept of: Produktark
definition: Dokumentet gir en overordnet presentasjon av produktet Skredfaresoner. NVE gjennomfører faresonekartlegging av skred i bratt terreng for utvalgte områder prioritert for kartlegging,
description: Dokumentet gir en overordnet presentasjon av produktet Skredfaresoner. NVE gjennomfører faresonekartlegging av skred i bratt terreng for utvalgte områder prioritert for kartlegging,
status: Gyldig

Hovedøkosystemer i Norge - versjon 1
type: Concept
in scheme: Produktark
top concept of: Produktark
status: Gyldig

Sårbare naturtyper i Sunnhordland - Sjøfjærsamfunn
type: Concept
in scheme: Produktark
top concept of: Produktark
status: Sendt inn

DTM 10
type: Concept
in scheme: Produktark
top concept of: Produktark
definition: Dokumentet gir en overordnet presentasjon av produktet "DTM 10" som er en digital terrengmodell med høyder i et rutenett på 10 x 10 meter.
description: Dokumentet gir en overordnet presentasjon av produktet "DTM 10" som er en digital terrengmodell med høyder i et rutenett på 10 x 10 meter.
status: Gyldig

Reindrift - Trekklei
type: Concept
in scheme: Produktark
top concept of: Produktark
definition: Dokumentet gir en overordnet presentasjon av produktet Reindrift - Trekklei. Trekklei viser viktige naturlige trekk mellom beiteområder og forbi passasjer, der reinen trekker av seg selv, enten enkeltvis eller i flokk.
description: Dokumentet gir en overordnet presentasjon av produktet Reindrift - Trekklei. Trekklei viser viktige naturlige trekk mellom beiteområder og forbi passasjer, der reinen trekker av seg selv, enten enkeltvis eller i flokk.
status: Gyldig

Mineralressurser; industrimineral, naturstein og metaller
type: Concept
in scheme: Produktark
top concept of: Produktark
definition: Dokumentet gir en overordnet presentasjon av produktet.
description: Dokumentet gir en overordnet presentasjon av produktet.
status: Gyldig

Støykartlegging veg etter T-1442
type: Concept
in scheme: Produktark
top concept of: Produktark
definition: Dokumentet gir en overordnet presentasjon av produktet.
description: Dokumentet gir en overordnet presentasjon av produktet.
status: Gyldig

Reindrift – Samebyrettsavgjørelse
type: Concept
in scheme: Produktark
top concept of: Produktark
status: Gyldig

Grunnkart for arealregnskap (Testversjon 1) oppdatert
type: Concept
in scheme: Produktark
top concept of: Produktark
definition: Grunnkartet kan testes ut som et et grunnlag for å etablere arealregnskap og kan suppleres med spesifikke data tilpasset ulike regnsapsformål
description: Grunnkartet kan testes ut som et et grunnlag for å etablere arealregnskap og kan suppleres med spesifikke data tilpasset ulike regnsapsformål
status: Sendt inn

Bunntyper fra sjømåling
type: Concept
in scheme: Produktark
top concept of: Produktark
definition: Dokumentet gir en oversikt over datasettet Bunntyper fra sjømåling, som består av over 62 000 datapunkter fra norske fjorder og kystnære områder. Datapunktene gir indikasjon om hvilken bunntype man kan forvente (f.eks. om det er grovkornige eller finkornige sedimenter).
description: Dokumentet gir en oversikt over datasettet Bunntyper fra sjømåling, som består av over 62 000 datapunkter fra norske fjorder og kystnære områder. Datapunktene gir indikasjon om hvilken bunntype man kan forvente (f.eks. om det er grovkornige eller finkornige sedimenter).
status: Gyldig

Tettsteder
type: Concept
in scheme: Produktark
top concept of: Produktark
definition: Dokumentet gir en overordnet presentasjon av produktet Tettsteder. Datasettet Norges tettsteder består av hussamlinger der det er registrert bosatt minst 200 personer og der avstanden mellom husene normalt ikke skal overstige 50 meter.
description: Dokumentet gir en overordnet presentasjon av produktet Tettsteder. Datasettet Norges tettsteder består av hussamlinger der det er registrert bosatt minst 200 personer og der avstanden mellom husene normalt ikke skal overstige 50 meter.
status: Gyldig

Mektighet av holosene sedimenter i Skagerrak og Norskerenna
type: Concept
in scheme: Produktark
top concept of: Produktark
definition: Dokumentet gir overordnet presentasjon av datasett Mektighet av holosene sedimenter i Skagerrak og Norskerenna
description: Dokumentet gir overordnet presentasjon av datasett Mektighet av holosene sedimenter i Skagerrak og Norskerenna
status: Gyldig

Norske fylker og kommuner (klippet etter kyst)
type: Concept
in scheme: Produktark
top concept of: Produktark
definition: Dokumentet gir en overordnet presentasjon av produktet "Norske fylker og kommuner (klippet etter kyst)".
description: Dokumentet gir en overordnet presentasjon av produktet "Norske fylker og kommuner (klippet etter kyst)".
status: Gyldig

Områder med farlige bølger langs Norskekysten
type: Concept
in scheme: Produktark
top concept of: Produktark
status: Gyldig

Naturtyper - Tarebiomasse
type: Concept
in scheme: Produktark
top concept of: Produktark
status: Gyldig

Nettkonsesjonsområder
type: Concept
in scheme: Produktark
top concept of: Produktark
definition: Produktark for nettkonsesjonsområder
description: Produktark for nettkonsesjonsområder
status: Gyldig

Fritidsbyggområder
type: Concept
in scheme: Produktark
top concept of: Produktark
definition: Med fritidsbyggområde (tettbygde) menes en samling med minst 5 fritidsbygg, der avstanden mellom byggene ikke overstiger 75 meter
description: Med fritidsbyggområde (tettbygde) menes en samling med minst 5 fritidsbygg, der avstanden mellom byggene ikke overstiger 75 meter
status: Gyldig

Bunnreflektivitet
type: Concept
in scheme: Produktark
top concept of: Produktark
definition: Dokumentet gir en overordnet presentasjon av datasettet Bunnreflektivitet. Bunnreflektivitet (backscatter) fra multistråleekkolodd gir informasjon om variasjon i bunntype.
description: Dokumentet gir en overordnet presentasjon av datasettet Bunnreflektivitet. Bunnreflektivitet (backscatter) fra multistråleekkolodd gir informasjon om variasjon i bunntype.
status: Gyldig

N50 Raster
type: Concept
in scheme: Produktark
top concept of: Produktark
definition: Dokumentet gir en overordnet presentasjon av produktet N50 Raster. N50 Raster er symbolisert tilnærmet lik hovedkartserieb Norge 1: 50 000.
description: Dokumentet gir en overordnet presentasjon av produktet N50 Raster. N50 Raster er symbolisert tilnærmet lik hovedkartserieb Norge 1: 50 000.
status: Gyldig

Ramsarområder
type: Concept
in scheme: Produktark
top concept of: Produktark
definition: Dokumentet gir en overordnet presentasjon av produktet Ramsarområder, som er et datasett som viser norske naturvernområder med status som ramsarområder, under den internasjonale våtmarkskonvensjonen (Ramsarkonvensjonen).
description: Dokumentet gir en overordnet presentasjon av produktet Ramsarområder, som er et datasett som viser norske naturvernområder med status som ramsarområder, under den internasjonale våtmarkskonvensjonen (Ramsarkonvensjonen).
status: Gyldig

N500 Kartdata
type: Concept
in scheme: Produktark
top concept of: Produktark
definition: Dokumentet gir en detaljert beskrivelse av datasettet «N500 Kartdata» og er basert på standarden ISO 19135 Data
description: Dokumentet gir en detaljert beskrivelse av datasettet «N500 Kartdata» og er basert på standarden ISO 19135 Data
status: Gyldig

Kulturminner - enkeltminner
type: Concept
in scheme: Produktark
top concept of: Produktark
definition: Dokumentet gir en overordnet presentasjon av produktet Kulturminner - enkeltminner. Datasetet inneholder, sammen med lokaliteten, all informasjon som er spesifikt for det enkelte objekt. Enkeltminnet kan ikke eksistere uten en lokalitet.
description: Dokumentet gir en overordnet presentasjon av produktet Kulturminner - enkeltminner. Datasetet inneholder, sammen med lokaliteten, all informasjon som er spesifikt for det enkelte objekt. Enkeltminnet kan ikke eksistere uten en lokalitet.
status: Gyldig

Akvakulturlokaliteter
type: Concept
in scheme: Produktark
top concept of: Produktark
definition: Dokumentet gir en overordnet presentasjon av produktet Akvakulturlokaliteter, som er et datasett som viser ca midtpunkt på alle godkjente akvakulturlokaliteter i Norge
description: Dokumentet gir en overordnet presentasjon av produktet Akvakulturlokaliteter, som er et datasett som viser ca midtpunkt på alle godkjente akvakulturlokaliteter i Norge
status: Gyldig

Korallrev
type: Concept
in scheme: Produktark
top concept of: Produktark
definition: Dokumentet gir en overordnet presentasjon av produktet Korallrev, som er et datasett som Sårbare naturtyper. Ulike typer koraller, svamper, sjøfjær og som er nøkkelartene i de sju naturtypene som er avdekket på havbunnen i områder som er kartlagt av bunnkartleggingsprogrammet MAREANO.
description: Dokumentet gir en overordnet presentasjon av produktet Korallrev, som er et datasett som Sårbare naturtyper. Ulike typer koraller, svamper, sjøfjær og som er nøkkelartene i de sju naturtypene som er avdekket på havbunnen i områder som er kartlagt av bunnkartleggingsprogrammet MAREANO.
status: Gyldig

Bedrifter på rutenett
type: Concept
in scheme: Produktark
top concept of: Produktark
definition: Dokumentet gir en overordnet presentasjon av produktet Bedrifter på rutenett
description: Dokumentet gir en overordnet presentasjon av produktet Bedrifter på rutenett
status: Gyldig

Dybdedata - dekning
type: Concept
in scheme: Produktark
top concept of: Produktark
definition: Datasett som viser en oversikt over hvilke norske sjøområder som har blitt dybdekartlagt/sjømålt.
description: Datasett som viser en oversikt over hvilke norske sjøområder som har blitt dybdekartlagt/sjømålt.
status: Sendt inn

Landbrukseiendomsstatistikk på rutenett
type: Concept
in scheme: Produktark
top concept of: Produktark
definition: Dokumentet gir en overordnet presentasjon av produktet Landbruksstatistikk på rutenett. dataene inneholder landbruksstatistikk på rutenett
description: Dokumentet gir en overordnet presentasjon av produktet Landbruksstatistikk på rutenett. dataene inneholder landbruksstatistikk på rutenett
status: Gyldig

Naturtyper i Norge - Landskap
type: Concept
in scheme: Produktark
top concept of: Produktark
definition: Dokumentet gir en overordnet presentasjon av produktet.
description: Dokumentet gir en overordnet presentasjon av produktet.
status: Gyldig

Viktige naturtyper
type: Concept
in scheme: Produktark
top concept of: Produktark
definition: Dokumentet gir en overordnet presentasjon av produktet Viktige naturtyper, som er et datasett som viser forekomster av naturtyper som er vurdert som svært viktige (A), viktige (B) og lokalt viktige (C) for biologisk mangfold.
description: Dokumentet gir en overordnet presentasjon av produktet Viktige naturtyper, som er et datasett som viser forekomster av naturtyper som er vurdert som svært viktige (A), viktige (B) og lokalt viktige (C) for biologisk mangfold.
status: Gyldig

Vannmasser - Overflatetemperatur
type: Concept
in scheme: Produktark
top concept of: Produktark
definition: Dokumentet gir en overordnet presentasjon av produktet.
description: Dokumentet gir en overordnet presentasjon av produktet.
status: Gyldig

Videregående skole
type: Concept
in scheme: Produktark
top concept of: Produktark
definition: Dokumentet gir en overordnet presentasjon av produktet.
description: Dokumentet gir en overordnet presentasjon av produktet.
status: Gyldig

Sivilforsvarsdistrikter
type: Concept
in scheme: Produktark
top concept of: Produktark
status: Gyldig

Sjø terrengmodeller
type: Concept
in scheme: Produktark
top concept of: Produktark
definition: Dokumentet gir en overordnet presentasjon av produktet Sjø terrengmodeller. Terrengmodellene er regulære grid for norske sjø- og havområder. Datasettene er laget på bakgrunn av moderne data, det vil si data innsamlet ved bruk av multistråle ekkolodd.
description: Dokumentet gir en overordnet presentasjon av produktet Sjø terrengmodeller. Terrengmodellene er regulære grid for norske sjø- og havområder. Datasettene er laget på bakgrunn av moderne data, det vil si data innsamlet ved bruk av multistråle ekkolodd.
status: Gyldig

Naturtyper - Elvedelta
type: Concept
in scheme: Produktark
top concept of: Produktark
status: Gyldig

Trafikkulykke
type: Concept
in scheme: Produktark
top concept of: Produktark
definition: Dokumentet gir en overordnet presentasjon av produktet Trafikkulykke. Datasettet beskriver alle trafikkulykker med personskader eller større materielle skader.
description: Dokumentet gir en overordnet presentasjon av produktet Trafikkulykke. Datasettet beskriver alle trafikkulykker med personskader eller større materielle skader.
status: Gyldig

Naturvernområder - v2
type: Concept
in scheme: Produktark
top concept of: Produktark
definition: Dokumentet gir en overordnet presentasjon av produktet.
description: Dokumentet gir en overordnet presentasjon av produktet.
status: Gyldig

Markfuktighetsklasser
type: Concept
in scheme: Produktark
top concept of: Produktark
definition: Dokumentet gir en overordnet presentasjon av produktet markfuktighetsklasser
description: Dokumentet gir en overordnet presentasjon av produktet markfuktighetsklasser
status: Gyldig

Sårbare marine biotoper – modellert utbredelse
type: Concept
in scheme: Produktark
top concept of: Produktark
definition: Dokumentet gir en overordnet presentasjon av produktet.
description: Dokumentet gir en overordnet presentasjon av produktet.
status: Gyldig

SR16
type: Concept
in scheme: Produktark
top concept of: Produktark
definition: Dokumentet gir en overordnet presentasjon av produktet SR16. Datasettet gir oversikt over utbredelsen og egenskaper ved landets skogressurser.
description: Dokumentet gir en overordnet presentasjon av produktet SR16. Datasettet gir oversikt over utbredelsen og egenskaper ved landets skogressurser.
status: Gyldig

Deldatasett aktsomhet jord- og flomskred
type: Concept
in scheme: Produktark
top concept of: Produktark
definition: Produktark for Deldatasett aktsomhet jord- og flomskred
description: Produktark for Deldatasett aktsomhet jord- og flomskred
status: Gyldig

NorKyst-800 Gjennomsnittlig sjøtemperatur
type: Concept
in scheme: Produktark
top concept of: Produktark
status: Gyldig

Skjellsand - områder
type: Concept
in scheme: Produktark
top concept of: Produktark
definition: Dokumentet gir en overordnet presentasjon av datasett "Skjellsand - områder", som viser områder (arealer) i kystsonen med informasjon om skjellsand på havbunnen.
description: Dokumentet gir en overordnet presentasjon av datasett "Skjellsand - områder", som viser områder (arealer) i kystsonen med informasjon om skjellsand på havbunnen.
status: Gyldig

Geologisk arv
type: Concept
in scheme: Produktark
top concept of: Produktark
definition: Dokumentet gir en overordnet presentasjon av produktet Geologisk arv. Datasettet geologisk arv viser geologiske lokaliteter av særlig verdi for undervisning, forskning og/eller formidling (geosteder).
description: Dokumentet gir en overordnet presentasjon av produktet Geologisk arv. Datasettet geologisk arv viser geologiske lokaliteter av særlig verdi for undervisning, forskning og/eller formidling (geosteder).
status: Gyldig

Nødhavner
type: Concept
in scheme: Produktark
top concept of: Produktark
definition: Dokumentet gir en overordnet presentasjon av produktet Nødhavner. Datasettet inneholder beskrivelse av Kystverkets forhåndsevaluerte nødhavnlokaliteter som inngår i Kystverkets beredskapsplanverk.
description: Dokumentet gir en overordnet presentasjon av produktet Nødhavner. Datasettet inneholder beskrivelse av Kystverkets forhåndsevaluerte nødhavnlokaliteter som inngår i Kystverkets beredskapsplanverk.
status: Gyldig

Fiskerihavner
type: Concept
in scheme: Produktark
top concept of: Produktark
definition: Dokumentet gir en overordnet presentasjon av produktet Fiskerihavner. Datasettet gir en oversikt over statlige fiskerihavner, både aktive og ikke aktive.
description: Dokumentet gir en overordnet presentasjon av produktet Fiskerihavner. Datasettet gir en oversikt over statlige fiskerihavner, både aktive og ikke aktive.
status: Gyldig

Kulturminner - Brannvern
type: Concept
in scheme: Produktark
top concept of: Produktark
definition: Dokumentet gir en overordnet presentasjon av produktet Kulturminner - Brannvern.
description: Dokumentet gir en overordnet presentasjon av produktet Kulturminner - Brannvern.
status: Gyldig

Tilfluktsrom - offentlige
type: Concept
in scheme: Produktark
top concept of: Produktark
definition: Dokumentet gir en overordnet presentasjon av produktet.
description: Dokumentet gir en overordnet presentasjon av produktet.
status: Gyldig

Støysoner for tunge våpen i Forsvarets skyte- og øvingsfelt
type: Concept
in scheme: Produktark
top concept of: Produktark
definition: Dokumentet gir en overordnet presentasjon av produktet.
description: Dokumentet gir en overordnet presentasjon av produktet.
status: Gyldig

N50 Kartdata
type: Concept
in scheme: Produktark
top concept of: Produktark
definition: Dokumentet gir en overordnet presentasjon av produktet N50 Kartdata, som er et datasett som er tilpasset målestokkområdet 1:25000 til 1:100000. Produktet har et innhold som tilsvarer kartserien Norge 1:50 000 med unntak av bathymetri(dybder).
description: Dokumentet gir en overordnet presentasjon av produktet N50 Kartdata, som er et datasett som er tilpasset målestokkområdet 1:25000 til 1:100000. Produktet har et innhold som tilsvarer kartserien Norge 1:50 000 med unntak av bathymetri(dybder).
status: Gyldig

Matrikkelen - Adresse
type: Concept
in scheme: Produktark
top concept of: Produktark
definition: Dokumentet gir en overordnet presentasjon av produktet.
description: Dokumentet gir en overordnet presentasjon av produktet.
status: Gyldig

Støysoner for Bane NORs jernbanenett
type: Concept
in scheme: Produktark
top concept of: Produktark
definition: Dokumentet gir en overordnet presentasjon av produktet Støysoner for Bane NORs jernbanenett.
description: Dokumentet gir en overordnet presentasjon av produktet Støysoner for Bane NORs jernbanenett.
status: Gyldig

Skjellsand
type: Concept
in scheme: Produktark
top concept of: Produktark
definition: Dokumentet gir en overordnet presentasjon av kartlagte og modellerte skjellsandforekomster (Skjellsand, forekomst), og skjellsand observert i bunnprøver (Skjellsand, observasjoner).
description: Dokumentet gir en overordnet presentasjon av kartlagte og modellerte skjellsandforekomster (Skjellsand, forekomst), og skjellsand observert i bunnprøver (Skjellsand, observasjoner).
status: Gyldig

Anadrome laksefisk - Utløpspunkt
type: Concept
in scheme: Produktark
top concept of: Produktark
status: Gyldig

Grunn gass
type: Concept
in scheme: Produktark
top concept of: Produktark
definition: Dokumentet gir en overordnet presentasjon av produktet grunn gass. Datasettet er en samling av landformer og fenomener i og på havbunnen forårsaket av naturgass i havbunnen.
description: Dokumentet gir en overordnet presentasjon av produktet grunn gass. Datasettet er en samling av landformer og fenomener i og på havbunnen forårsaket av naturgass i havbunnen.
status: Gyldig

Nasjonal marin verneplan - Rådgivende utvalgs A-liste
type: Concept
in scheme: Produktark
top concept of: Produktark
status: Gyldig

FKB-Bane
type: Concept
in scheme: Produktark
top concept of: Produktark
definition: Dokumentet gir en overordnet presentasjon av produktet FKB-Bane, som er et datasett som omfatter jernbanens infrastruktur - i hovedsak banelegemet
description: Dokumentet gir en overordnet presentasjon av produktet FKB-Bane, som er et datasett som omfatter jernbanens infrastruktur - i hovedsak banelegemet
status: Gyldig

Vannmasser - Bunntemperatur
type: Concept
in scheme: Produktark
top concept of: Produktark
status: Gyldig

N20 Bygning
type: Concept
in scheme: Produktark
top concept of: Produktark
definition: Dokumentet gir en overordnet presentasjon av produktet N20 Bygning som er et datasett som inneholder bygninger tilpasset målestokk 1:20000
description: Dokumentet gir en overordnet presentasjon av produktet N20 Bygning som er et datasett som inneholder bygninger tilpasset målestokk 1:20000
status: Gyldig

Naturvernområder
type: Concept
in scheme: Produktark
top concept of: Produktark
definition: Datasettet inneholder verneområder og vernede enkeltobjekt i Norge, herunder Svalbard og Jan Mayen. Datasettet gir en oversikt over hvilke områder som er vernet etter følgende lover: naturmangfoldloven av 2009, biotopvern etter viltloven av 1981, naturvernloven av 1970, lov om naturvern av 1954, lov om Jan Mayen av 1930 og lov om naturfredning av 1910. I tillegg inneholder det områder vernet etter følgende lovverk på Svalbard: Svalbardloven av 1925 og Svalbardmiljøloven av 2002. Datasettet gir også tilgang til lovforskriften som gjelder for hvert enkelt vernevedtak.
description: Datasettet inneholder verneområder og vernede enkeltobjekt i Norge, herunder Svalbard og Jan Mayen. Datasettet gir en oversikt over hvilke områder som er vernet etter følgende lover: naturmangfoldloven av 2009, biotopvern etter viltloven av 1981, naturvernloven av 1970, lov om naturvern av 1954, lov om Jan Mayen av 1930 og lov om naturfredning av 1910. I tillegg inneholder det områder vernet etter følgende lovverk på Svalbard: Svalbardloven av 1925 og Svalbardmiljøloven av 2002. Datasettet gir også tilgang til lovforskriften som gjelder for hvert enkelt vernevedtak.
status: Gyldig

Anadrome laksefisk - Bestander
type: Concept
in scheme: Produktark
top concept of: Produktark
status: Gyldig

Landskap
type: Concept
in scheme: Produktark
top concept of: Produktark
definition: Dokumentet gir en overordnet presentasjon av produktet Landskap. Dataene viser landskaps-messige og regionale forskjeller i Norge.
description: Dokumentet gir en overordnet presentasjon av produktet Landskap. Dataene viser landskaps-messige og regionale forskjeller i Norge.
status: Gyldig

Anadrome laksefisk - Strekninger
type: Concept
in scheme: Produktark
top concept of: Produktark
status: Gyldig

Flomsoner
type: Concept
in scheme: Produktark
top concept of: Produktark
definition: Flomsoner viser arealer som oversvømmes ved ulike flomstørrelser (gjentaksintervall). Det blir utarbeidet flomsoner for 20-, 200- og 1000-årsflommene. I områder der klimaendringene gir en forventet økning i vannføringen på mer enn 20 %, utarbeides det flomsone for 200-årsflommen i år 2100.
description: Flomsoner viser arealer som oversvømmes ved ulike flomstørrelser (gjentaksintervall). Det blir utarbeidet flomsoner for 20-, 200- og 1000-årsflommene. I områder der klimaendringene gir en forventet økning i vannføringen på mer enn 20 %, utarbeides det flomsone for 200-årsflommen i år 2100.
status: Gyldig

Bergede fiskeredskaper i Spøkelsesfiske-prosjektet
type: Concept
in scheme: Produktark
top concept of: Produktark
status: Sendt inn

Støysoner
type: Concept
in scheme: Produktark
top concept of: Produktark
definition: Dokumentet gir en overordnet presentasjon av produktet Støysoner, som viser støysoner for en lufthavn. Støysoner er behandlet iht. T-1442 Retningslinjer for behandling av støy i arealplanlegging.
description: Dokumentet gir en overordnet presentasjon av produktet Støysoner, som viser støysoner for en lufthavn. Støysoner er behandlet iht. T-1442 Retningslinjer for behandling av støy i arealplanlegging.
status: Gyldig

FKB-Tekst1000
type: Concept
in scheme: Produktark
top concept of: Produktark
definition: Dokumentet gir en overordnet presentasjon av produktet FKB-Tekst1000, som er et datasett som er tilleggsdata til FKB som er nødvendige for å formidle en god presentasjon uten at deopprinnelige datasettene blir berørt
description: Dokumentet gir en overordnet presentasjon av produktet FKB-Tekst1000, som er et datasett som er tilleggsdata til FKB som er nødvendige for å formidle en god presentasjon uten at deopprinnelige datasettene blir berørt
status: Tilbaketrukket

Kulturminner - Brannsmitteområder
type: Concept
in scheme: Produktark
top concept of: Produktark
definition: Dokumentet gir en overordnet presentasjon av produktet Kulturminner-brannsmitteområder. Datasettet viser områder med særlig stor fare for spredning av brann som definert av Direktoratet for samfunnssikkerhet og beredskap (DSB) i samarbeid med Riksantikvaren.
description: Dokumentet gir en overordnet presentasjon av produktet Kulturminner-brannsmitteområder. Datasettet viser områder med særlig stor fare for spredning av brann som definert av Direktoratet for samfunnssikkerhet og beredskap (DSB) i samarbeid med Riksantikvaren.
status: Gyldig

Byggeforbudssoner kraftledninger
type: Concept
in scheme: Produktark
top concept of: Produktark
definition: Byggeforbudssoner for Statnetts kraftledninger. Dette er arealer rundt kraftledninger som er klausulert i medhold av konsesjon etter energiloven og ekspropriasjon etter oreigningsloven eller minnelig avtale med berørte grunneiere.
description: Byggeforbudssoner for Statnetts kraftledninger. Dette er arealer rundt kraftledninger som er klausulert i medhold av konsesjon etter energiloven og ekspropriasjon etter oreigningsloven eller minnelig avtale med berørte grunneiere.
status: Gyldig

Losbordingsfelt
type: Concept
in scheme: Produktark
top concept of: Produktark
definition: Dokumentet gir en overordnet presentasjon av produktet Losbordingsfelt. Losbordingsfelt er angitt som et geografisk punkt i sjøkartet fastsatt av Kystverket.
description: Dokumentet gir en overordnet presentasjon av produktet Losbordingsfelt. Losbordingsfelt er angitt som et geografisk punkt i sjøkartet fastsatt av Kystverket.
status: Gyldig

Mareano kjemistasjoner
type: Concept
in scheme: Produktark
top concept of: Produktark
definition: Dokumentet gir en overordnet presentasjon av produktet.
description: Dokumentet gir en overordnet presentasjon av produktet.
status: Gyldig

Marint søppel per videotransekt
type: Concept
in scheme: Produktark
top concept of: Produktark
status: Gyldig

Sjøkart raster
type: Concept
in scheme: Produktark
top concept of: Produktark
definition: Dokumentet gir en overordnet presentasjon av produktet Sjøkart raster som består av digitale versjoner av Norges offisielle sjøkart fra 4 forskjellige kartserier.
description: Dokumentet gir en overordnet presentasjon av produktet Sjøkart raster som består av digitale versjoner av Norges offisielle sjøkart fra 4 forskjellige kartserier.
status: Gyldig

Naturvernområder - foreslåtte
type: Concept
in scheme: Produktark
top concept of: Produktark
definition: Dokumentet gir en overordnet presentasjon av produktet.
description: Dokumentet gir en overordnet presentasjon av produktet.
status: Gyldig