Produktspesifikasjoner
type: ConceptScheme
description: Inneholder dokumenter for produktspesifikasjoner for kart- og geodata

Topografisk Grunndatabase
type: Concept
in scheme: Produktspesifikasjoner
top concept of: Produktspesifikasjoner
status: Utkast

Kulturminner - Enkeltminner
type: Concept
in scheme: Produktspesifikasjoner
top concept of: Produktspesifikasjoner
definition: Produktspesifikasjonen beskriver datasettet Enkeltminner for det offentlige kartgrunnlaget
description: Produktspesifikasjonen beskriver datasettet Enkeltminner for det offentlige kartgrunnlaget
status: SOSI godkjent

Forurenset grunn
type: Concept
in scheme: Produktspesifikasjoner
top concept of: Produktspesifikasjoner
definition: Dokumentet gir en detaljert beskrivelse av datasettet "Forurenset grunn" og er basert på standarden ISO 19135 Data Product Specification. Datasettet omfatter eiendommer med forurenset grunn samt kommunale og private-/ industrideponier.
description: Dokumentet gir en detaljert beskrivelse av datasettet "Forurenset grunn" og er basert på standarden ISO 19135 Data Product Specification. Datasettet omfatter eiendommer med forurenset grunn samt kommunale og private-/ industrideponier.
status: SOSI godkjent

Reindrift - Trekklei
type: Concept
in scheme: Produktspesifikasjoner
top concept of: Produktspesifikasjoner
definition: Dokumentet gir en detaljert beskrivelse av datasettet "Reindrift - Trekklei" og er basert på standarden ISO 19135 Data Product Specification.
description: Dokumentet gir en detaljert beskrivelse av datasettet "Reindrift - Trekklei" og er basert på standarden ISO 19135 Data Product Specification.
status: SOSI godkjent

Stedsnavn for vanlig bruk
type: Concept
in scheme: Produktspesifikasjoner
top concept of: Produktspesifikasjoner
definition: Dokumentet gir en detaljert beskrivelse av datasettet "Stedsnavn" og er basert på standarden ISO 19131 Data Product Specification
description: Dokumentet gir en detaljert beskrivelse av datasettet "Stedsnavn" og er basert på standarden ISO 19131 Data Product Specification
status: SOSI godkjent

Naturtyper - DN-håndbok 19
type: Concept
in scheme: Produktspesifikasjoner
top concept of: Produktspesifikasjoner
definition: Dokumentet gir en detaljert beskrivelse av datasettet og er basert på standarden ISO 19131 Data Product Specification.
description: Dokumentet gir en detaljert beskrivelse av datasettet og er basert på standarden ISO 19131 Data Product Specification.
status: SOSI godkjent

Vertikalbilde
type: Concept
in scheme: Produktspesifikasjoner
top concept of: Produktspesifikasjoner
definition: Dokumentet spesifiserer leveranser fra flyfotografering. Med leveranser forstås her: leveranse av bildedata, orienteringsdata og vertikalbildedekning (metadata).
description: Dokumentet spesifiserer leveranser fra flyfotografering. Med leveranser forstås her: leveranse av bildedata, orienteringsdata og vertikalbildedekning (metadata).
status: Gyldig

Nasjonal produktspesifikasjon for arealplan og digitalt planregister Del 1 - Spesifikasjon for plankart
type: Concept
in scheme: Produktspesifikasjoner
top concept of: Produktspesifikasjoner
definition: Dokumentet gir en detaljert beskrivelse av datasettet "Plankart" og er basert på standarden ISO 19135 Data Product Specification
description: Dokumentet gir en detaljert beskrivelse av datasettet "Plankart" og er basert på standarden ISO 19135 Data Product Specification
status: Tilbaketrukket

Reindrift - Årstidsbeite - Sommerbeite
type: Concept
in scheme: Produktspesifikasjoner
top concept of: Produktspesifikasjoner
definition: Dokumentet gir en detaljert beskrivelse av datasettet "Reindrift - Sommerbeite" og er basert på standarden ISO 19135 Data Product Specification.
description: Dokumentet gir en detaljert beskrivelse av datasettet "Reindrift - Sommerbeite" og er basert på standarden ISO 19135 Data Product Specification.
status: SOSI godkjent

Grunnvannsborehull
type: Concept
in scheme: Produktspesifikasjoner
top concept of: Produktspesifikasjoner
definition: Dokumentet gir en detaljert beskrivelse av datasettet "Grunnvannsborehull" og er basert på standarden ISO 19131 Data Product Specification
description: Dokumentet gir en detaljert beskrivelse av datasettet "Grunnvannsborehull" og er basert på standarden ISO 19131 Data Product Specification
status: SOSI godkjent

Sjøkart - Dybdedata
type: Concept
in scheme: Produktspesifikasjoner
top concept of: Produktspesifikasjoner
definition: Dokumentet gir en detaljert beskrivelse av datasettet "Sjøkart - Dybdedata" og er basert på standarden ISO 19131 Data Product Specification
description: Dokumentet gir en detaljert beskrivelse av datasettet "Sjøkart - Dybdedata" og er basert på standarden ISO 19131 Data Product Specification
status: SOSI godkjent

Primærdata Lufthavn
type: Concept
in scheme: Produktspesifikasjoner
top concept of: Produktspesifikasjoner
definition: Dokumentet gir en detaljert beskrivelse av datasettet Primærdata Lufthavn
description: Dokumentet gir en detaljert beskrivelse av datasettet Primærdata Lufthavn
status: Utkast

Politisoner og -distrikter
type: Concept
in scheme: Produktspesifikasjoner
top concept of: Produktspesifikasjoner
status: Utkast

Stedfestingsdata for ledningsnett som er etablert eller flyttet
type: Concept
in scheme: Produktspesifikasjoner
top concept of: Produktspesifikasjoner
definition: Dokumentet gir en detaljert beskrivelse av "Stedfestingsdata for ledningsnett som er etablert eller flyttet" og er basert på standarden ISO 19131 Data Product Specification
description: Dokumentet gir en detaljert beskrivelse av "Stedfestingsdata for ledningsnett som er etablert eller flyttet" og er basert på standarden ISO 19131 Data Product Specification
status: Gyldig

Produktspesifikasjon: Akkumulasjonsrater for organisk karbon i havbunnsedimenter i Nordsjøen og Skagerrak
type: Concept
in scheme: Produktspesifikasjoner
top concept of: Produktspesifikasjoner
definition: Dokumentet gir en detaljert beskrivelse av datasettet og er basert på standarden ISO 19131 Data Product Specification.
description: Dokumentet gir en detaljert beskrivelse av datasettet og er basert på standarden ISO 19131 Data Product Specification.
status: Sendt inn

Grus og pukk
type: Concept
in scheme: Produktspesifikasjoner
top concept of: Produktspesifikasjoner
definition: Dokumentet gir en detaljert beskrivelse av datasettet "Grus og pukk" og er basert på standarden ISO 19135 Data Product Specification
description: Dokumentet gir en detaljert beskrivelse av datasettet "Grus og pukk" og er basert på standarden ISO 19135 Data Product Specification
status: SOSI godkjent

Sårbare marine biotoper - modellert utbredelse
type: Concept
in scheme: Produktspesifikasjoner
top concept of: Produktspesifikasjoner
definition: Dokumentet gir en detaljert beskrivelse av datasettet og er basert på standarden ISO 19131 Data Product Specification.
description: Dokumentet gir en detaljert beskrivelse av datasettet og er basert på standarden ISO 19131 Data Product Specification.
status: SOSI godkjent

Barnetråkk - aggregert
type: Concept
in scheme: Produktspesifikasjoner
top concept of: Produktspesifikasjoner
definition: Dokumentet gir en detaljert beskrivelse av datasettet og er basert på standarden ISO 19131 Data Product Specification.
description: Dokumentet gir en detaljert beskrivelse av datasettet og er basert på standarden ISO 19131 Data Product Specification.
status: SOSI godkjent

Artsmangfold - Svampobservasjoner per videotransekt
type: Concept
in scheme: Produktspesifikasjoner
top concept of: Produktspesifikasjoner
definition: Dokumentet gir en detaljert beskrivelse av datasettet og er basert på standarden ISO 19131 Data Product Specification.
description: Dokumentet gir en detaljert beskrivelse av datasettet og er basert på standarden ISO 19131 Data Product Specification.
status: SOSI godkjent

Marin grense
type: Concept
in scheme: Produktspesifikasjoner
top concept of: Produktspesifikasjoner
definition: Dokumentet gir en detaljert beskrivelse av datasettet "Marin grense" og er basert på standarden ISO 19131 Data Product Specification
description: Dokumentet gir en detaljert beskrivelse av datasettet "Marin grense" og er basert på standarden ISO 19131 Data Product Specification
status: SOSI godkjent

Jordsmonn
type: Concept
in scheme: Produktspesifikasjoner
top concept of: Produktspesifikasjoner
definition: Dokumentet gir en detaljert beskrivelse av datasettet "Jordsmonn" og er basert på standarden ISO 19135 Data Product Specification
description: Dokumentet gir en detaljert beskrivelse av datasettet "Jordsmonn" og er basert på standarden ISO 19135 Data Product Specification
status: SOSI godkjent

Kirkebygg - forenklet
type: Concept
in scheme: Produktspesifikasjoner
top concept of: Produktspesifikasjoner
definition: Beskriver forenklet informasjon for kirkebygg hentet fra Kirkebyggdatabasen
description: Beskriver forenklet informasjon for kirkebygg hentet fra Kirkebyggdatabasen
status: Gyldig

Matrikkelen - Eiendomskart Teig
type: Concept
in scheme: Produktspesifikasjoner
top concept of: Produktspesifikasjoner
definition: Dokumentet gir en detaljert beskrivelse av datasettet "Matrikkelen - Eiendomskart Teig" og er basert på standarden ISO 19131 Data Product Specification
description: Dokumentet gir en detaljert beskrivelse av datasettet "Matrikkelen - Eiendomskart Teig" og er basert på standarden ISO 19131 Data Product Specification
status: SOSI godkjent

Matrikkelen - Adresse - Leilighetsnivå
type: Concept
in scheme: Produktspesifikasjoner
top concept of: Produktspesifikasjoner
definition: Dokumentet gir en detaljert beskrivelse av datasettet og er basert på standarden ISO 19131 Data Product Specification
description: Dokumentet gir en detaljert beskrivelse av datasettet og er basert på standarden ISO 19131 Data Product Specification
status: SOSI godkjent

Nasjonalt grunnkart for arealanalyse
type: Concept
in scheme: Produktspesifikasjoner
top concept of: Produktspesifikasjoner
definition: Dokumentet gir en detaljert beskrivelse av datasettet "Nasjonalt grunnkart for arealanalyse"
description: Dokumentet gir en detaljert beskrivelse av datasettet "Nasjonalt grunnkart for arealanalyse"
status: Sendt inn

Del 4 - Spesifikasjon for kommunalt planregister
type: Concept
in scheme: Produktspesifikasjoner
top concept of: Produktspesifikasjoner
definition: Nasjonal produktspesifikasjon for arealplan og digitalt planregister - del 4.
description: Nasjonal produktspesifikasjon for arealplan og digitalt planregister - del 4.
status: Gyldig

Nettanlegg
type: Concept
in scheme: Produktspesifikasjoner
top concept of: Produktspesifikasjoner
definition: Dokumentet gir en detaljert beskrivelse av datasettet «Nettanlegg» og er basert på standarden ISO 19131 Data Product Specification
description: Dokumentet gir en detaljert beskrivelse av datasettet «Nettanlegg» og er basert på standarden ISO 19131 Data Product Specification
status: SOSI godkjent

Kulturminner - Brannvern
type: Concept
in scheme: Produktspesifikasjoner
top concept of: Produktspesifikasjoner
definition: Dokumentet gir en detaljert beskrivelse av datasettet "Kulturminner - Brannvern" og er basert på standarden ISO 19131 Data Product Specification
description: Dokumentet gir en detaljert beskrivelse av datasettet "Kulturminner - Brannvern" og er basert på standarden ISO 19131 Data Product Specification
status: SOSI godkjent

FKB Tekst5000
type: Concept
in scheme: Produktspesifikasjoner
top concept of: Produktspesifikasjoner
definition: Dokumentet gir en detaljert beskrivelse av datasettet "FKB Tekst5000" og er basert på standarden ISO 19135 Data Product Specification
description: Dokumentet gir en detaljert beskrivelse av datasettet "FKB Tekst5000" og er basert på standarden ISO 19135 Data Product Specification
status: Tilbaketrukket

Gravbarhet
type: Concept
in scheme: Produktspesifikasjoner
top concept of: Produktspesifikasjoner
definition: Dokumentet gir en detaljert beskrivelse av datasettet "Gravbarhet" og er basert på standarden ISO 19131 Data Product Specification. Datasettet viser forekomster av naturtyper som er vurdert som svært viktige (A), viktige (B) og lokalt viktige (C) for biologisk mangfold.
description: Dokumentet gir en detaljert beskrivelse av datasettet "Gravbarhet" og er basert på standarden ISO 19131 Data Product Specification. Datasettet viser forekomster av naturtyper som er vurdert som svært viktige (A), viktige (B) og lokalt viktige (C) for biologisk mangfold.
status: SOSI godkjent

FKB Ledning Bane (forvaltning)
type: Concept
in scheme: Produktspesifikasjoner
top concept of: Produktspesifikasjoner
definition: Dokumentet gir en detaljert beskrivelse av datasettet "FKB Ledning Bane" og er basert på standarden ISO 19131 Data Product Specification
description: Dokumentet gir en detaljert beskrivelse av datasettet "FKB Ledning Bane" og er basert på standarden ISO 19131 Data Product Specification
status: Tilbaketrukket

Turrutebasen
type: Concept
in scheme: Produktspesifikasjoner
top concept of: Produktspesifikasjoner
definition: Dokumentet gir en detaljert beskrivelse av datasettet "Tur- og friluftsruter" og er basert på standarden ISO 19135 Data Product Specification
description: Dokumentet gir en detaljert beskrivelse av datasettet "Tur- og friluftsruter" og er basert på standarden ISO 19135 Data Product Specification
status: SOSI godkjent

Reindrift - Avtaleområde
type: Concept
in scheme: Produktspesifikasjoner
top concept of: Produktspesifikasjoner
definition: Dokumentet gir en detaljert beskrivelse av datasettet "Reindrift - Avtaleområde" og er basert på standarden ISO 19135 Data Product Specification.
description: Dokumentet gir en detaljert beskrivelse av datasettet "Reindrift - Avtaleområde" og er basert på standarden ISO 19135 Data Product Specification.
status: SOSI godkjent

Sjø terrengmodeller
type: Concept
in scheme: Produktspesifikasjoner
top concept of: Produktspesifikasjoner
definition: Dokumentet gir en detaljert beskrivelse av datasettet "Sjø terrengmodeller" og er basert på standarden ISO 19131 Data Product Specification
description: Dokumentet gir en detaljert beskrivelse av datasettet "Sjø terrengmodeller" og er basert på standarden ISO 19131 Data Product Specification
status: SOSI godkjent

Del 3.3 - Reguleringsplanforslag
type: Concept
in scheme: Produktspesifikasjoner
top concept of: Produktspesifikasjoner
definition: Viser spesifikasjon for forslag til ny reguleringsplan. Her vil det være tillatt med én plan, dvs. ett planområde som forholder seg til plan- og bygningsloven(pbl.) kap. 12.
description: Viser spesifikasjon for forslag til ny reguleringsplan. Her vil det være tillatt med én plan, dvs. ett planområde som forholder seg til plan- og bygningsloven(pbl.) kap. 12.
status: Gyldig

Kulturminner - Sikringssoner
type: Concept
in scheme: Produktspesifikasjoner
top concept of: Produktspesifikasjoner
definition: Produktspesifikasjonen beskriver datasettet Sikringssoner for det offentlige kartgrunnlaget
description: Produktspesifikasjonen beskriver datasettet Sikringssoner for det offentlige kartgrunnlaget
status: SOSI godkjent

Erosjonsrisiko
type: Concept
in scheme: Produktspesifikasjoner
top concept of: Produktspesifikasjoner
status: Utkast

Storulykkeanlegg
type: Concept
in scheme: Produktspesifikasjoner
top concept of: Produktspesifikasjoner
definition: Dokumentet gir en detaljert beskrivelse av datasettet "Storulykkeanlegg" og er basert på standarden ISO 19131 Data Product Specification.
description: Dokumentet gir en detaljert beskrivelse av datasettet "Storulykkeanlegg" og er basert på standarden ISO 19131 Data Product Specification.
status: SOSI godkjent

Postnummerområder
type: Concept
in scheme: Produktspesifikasjoner
top concept of: Produktspesifikasjoner
status: Gyldig

Datakvalitet på dybdedata i navigasjonsproduktene
type: Concept
in scheme: Produktspesifikasjoner
top concept of: Produktspesifikasjoner
status: Gyldig

NPAD Del 3.4 - Planlegging igangsatt
type: Concept
in scheme: Produktspesifikasjoner
top concept of: Produktspesifikasjoner
definition: Spesifikasjon for å identifisere og avgrense område der det er igangsatt planlegging
description: Spesifikasjon for å identifisere og avgrense område der det er igangsatt planlegging
status: Sendt inn

Hornkoraller
type: Concept
in scheme: Produktspesifikasjoner
top concept of: Produktspesifikasjoner
definition: Dokumentet gir en detaljert beskrivelse av datasettet og er basert på standarden ISO 19131 Data Product Specification.
description: Dokumentet gir en detaljert beskrivelse av datasettet og er basert på standarden ISO 19131 Data Product Specification.
status: SOSI godkjent

Stedsnavn (Komplett SSR)
type: Concept
in scheme: Produktspesifikasjoner
top concept of: Produktspesifikasjoner
definition: Dokumentet gir en detaljert beskrivelse av datasettet "Stedsnavn" og er basert på standarden ISO 19135 Data Product Specification
description: Dokumentet gir en detaljert beskrivelse av datasettet "Stedsnavn" og er basert på standarden ISO 19135 Data Product Specification
status: SOSI godkjent

Landformer
type: Concept
in scheme: Produktspesifikasjoner
top concept of: Produktspesifikasjoner
definition: Dokumentet gir en detaljert beskrivelse av datasettet Landformer.
description: Dokumentet gir en detaljert beskrivelse av datasettet Landformer.
status: Sendt inn

Aktsomhetskart for kvikkleireskred
type: Concept
in scheme: Produktspesifikasjoner
top concept of: Produktspesifikasjoner
status: Gyldig

Reindrift - Flyttlei
type: Concept
in scheme: Produktspesifikasjoner
top concept of: Produktspesifikasjoner
definition: Dokumentet gir en detaljert beskrivelse av datasettet "Reindrift Flyttlei" og er basert på standarden ISO 19135 Data Product Specification.
description: Dokumentet gir en detaljert beskrivelse av datasettet "Reindrift Flyttlei" og er basert på standarden ISO 19135 Data Product Specification.
status: SOSI godkjent

Jernbane - Banenettverk
type: Concept
in scheme: Produktspesifikasjoner
top concept of: Produktspesifikasjoner
definition: Dokumentet gir en detaljert beskrivelse av datasettet "Jernbane - Banenettverk" og er basert på standarden ISO 19131 Data Product Specification
description: Dokumentet gir en detaljert beskrivelse av datasettet "Jernbane - Banenettverk" og er basert på standarden ISO 19131 Data Product Specification
status: SOSI godkjent

FKB BygnAnlegg
type: Concept
in scheme: Produktspesifikasjoner
top concept of: Produktspesifikasjoner
definition: Dokumentet gir en detaljert beskrivelse av datasettet "FKB BygnAnlegg" og er basert på standarden ISO 19131 Data Product Specification
description: Dokumentet gir en detaljert beskrivelse av datasettet "FKB BygnAnlegg" og er basert på standarden ISO 19131 Data Product Specification
status: SOSI godkjent

Bunnsedimenter dannelse
type: Concept
in scheme: Produktspesifikasjoner
top concept of: Produktspesifikasjoner
definition: Dokumentet gir en detaljert beskrivelse av datasettet "Bunnsedimenter dannelse" og er basert på standarden ISO 19131 Data Product Specification
description: Dokumentet gir en detaljert beskrivelse av datasettet "Bunnsedimenter dannelse" og er basert på standarden ISO 19131 Data Product Specification
status: SOSI godkjent

N50 Kartdata
type: Concept
in scheme: Produktspesifikasjoner
top concept of: Produktspesifikasjoner
definition: Dokumentet gir en detaljert beskrivelse av datasettet "N50 Kartdata" og er basert på standarden ISO 19135 Data Product Specification
description: Dokumentet gir en detaljert beskrivelse av datasettet "N50 Kartdata" og er basert på standarden ISO 19135 Data Product Specification
status: SOSI godkjent

Jordkvalitet
type: Concept
in scheme: Produktspesifikasjoner
top concept of: Produktspesifikasjoner
definition: Dokumentet gir en detaljert beskrivelse av datasettet "Jordkvalitet" og er basert på standarden ISO 19131 Data Product Specification
description: Dokumentet gir en detaljert beskrivelse av datasettet "Jordkvalitet" og er basert på standarden ISO 19131 Data Product Specification
status: SOSI godkjent

Sjøkart - raster hovedkart
type: Concept
in scheme: Produktspesifikasjoner
top concept of: Produktspesifikasjoner
definition: Dokumentet gir en detaljert beskrivelse av datasettet.
description: Dokumentet gir en detaljert beskrivelse av datasettet.
status: Gyldig

Interkommunale brannvesen
type: Concept
in scheme: Produktspesifikasjoner
top concept of: Produktspesifikasjoner
definition: Dokumentet gir en detaljert beskrivelse av datasettet "Interkommunale Brannvesen" og er basert på standarden ISO 19131 Data Product Specification
description: Dokumentet gir en detaljert beskrivelse av datasettet "Interkommunale Brannvesen" og er basert på standarden ISO 19131 Data Product Specification
status: SOSI godkjent

Trålspor
type: Concept
in scheme: Produktspesifikasjoner
top concept of: Produktspesifikasjoner
definition: Dokumentet gir en detaljert beskrivelse av datasettet og er basert på standarden ISO 19131 Data Product Specification.
description: Dokumentet gir en detaljert beskrivelse av datasettet og er basert på standarden ISO 19131 Data Product Specification.
status: SOSI godkjent

FKB Grønnstruktur
type: Concept
in scheme: Produktspesifikasjoner
top concept of: Produktspesifikasjoner
status: SOSI godkjent

Reindrift - Årstidsbeite - Høstbeite
type: Concept
in scheme: Produktspesifikasjoner
top concept of: Produktspesifikasjoner
definition: Dokumentet gir en detaljert beskrivelse av datasettet "Reindrift - Høstbeite" og er basert på standarden ISO 19135 Data Product Specification.
description: Dokumentet gir en detaljert beskrivelse av datasettet "Reindrift - Høstbeite" og er basert på standarden ISO 19135 Data Product Specification.
status: SOSI godkjent

Befolkning på grunnkretsnivå
type: Concept
in scheme: Produktspesifikasjoner
top concept of: Produktspesifikasjoner
definition: Produktspesifikasjonen beskriver datasettet befolkning på grunnkretsnivå
description: Produktspesifikasjonen beskriver datasettet befolkning på grunnkretsnivå
status: SOSI godkjent

FKB Ledning Belysning (forvaltning)
type: Concept
in scheme: Produktspesifikasjoner
top concept of: Produktspesifikasjoner
definition: Dokumentet gir en detaljert beskrivelse av datasettet "FKB Ledning Belysning" og er basert på standarden ISO 19131 Data Product Specification
description: Dokumentet gir en detaljert beskrivelse av datasettet "FKB Ledning Belysning" og er basert på standarden ISO 19131 Data Product Specification
status: Tilbaketrukket

Mulighet for marin leire
type: Concept
in scheme: Produktspesifikasjoner
top concept of: Produktspesifikasjoner
definition: Dokumentet gir en detaljert beskrivelse av datasettet "Mulighet for marin leire" og er basert på standarden ISO 19131 Data Product Specification
description: Dokumentet gir en detaljert beskrivelse av datasettet "Mulighet for marin leire" og er basert på standarden ISO 19131 Data Product Specification
status: Utkast

Ankringsforhold
type: Concept
in scheme: Produktspesifikasjoner
top concept of: Produktspesifikasjoner
definition: Dokumentet gir en detaljert beskrivelse av datasettet og er basert på standarden ISO 19131 Data Product Specification.
description: Dokumentet gir en detaljert beskrivelse av datasettet og er basert på standarden ISO 19131 Data Product Specification.
status: SOSI godkjent

FKB Tiltak
type: Concept
in scheme: Produktspesifikasjoner
top concept of: Produktspesifikasjoner
definition: Dokumentet gir en detaljert beskrivelse av datasettet "FKB Tiltak" og er basert på standarden ISO 19131 Data Product Specification
description: Dokumentet gir en detaljert beskrivelse av datasettet "FKB Tiltak" og er basert på standarden ISO 19131 Data Product Specification
status: SOSI godkjent

Dyrkbar jord
type: Concept
in scheme: Produktspesifikasjoner
top concept of: Produktspesifikasjoner
definition: Dokumentet gir en detaljert beskrivelse av datasettet "Dyrkbar jord" og er basert på standarden ISO 19131 Data Product Specification.
description: Dokumentet gir en detaljert beskrivelse av datasettet "Dyrkbar jord" og er basert på standarden ISO 19131 Data Product Specification.
status: SOSI godkjent

FKB AR5
type: Concept
in scheme: Produktspesifikasjoner
top concept of: Produktspesifikasjoner
definition: Dokumentet gir en detaljert beskrivelse av datasettet "FKB-AR5" og er basert på standarden ISO 19131 Data Product Specification
description: Dokumentet gir en detaljert beskrivelse av datasettet "FKB-AR5" og er basert på standarden ISO 19131 Data Product Specification
status: SOSI godkjent

FKB Generell del
type: Concept
in scheme: Produktspesifikasjoner
top concept of: Produktspesifikasjoner
definition: Dokumentet gir en detaljert beskrivelse av datasettet "FKB Generell del" og er basert på standarden ISO 19131 Data Product Specification
description: Dokumentet gir en detaljert beskrivelse av datasettet "FKB Generell del" og er basert på standarden ISO 19131 Data Product Specification
status: SOSI godkjent

Sjøkart - Maritim infrastruktur
type: Concept
in scheme: Produktspesifikasjoner
top concept of: Produktspesifikasjoner
definition: Dokumentet gir en detaljert beskrivelse av datasettet "Sjøkart - Maritim infrastruktur" og er basert på standarden ISO 19131 Data Product Specification.
description: Dokumentet gir en detaljert beskrivelse av datasettet "Sjøkart - Maritim infrastruktur" og er basert på standarden ISO 19131 Data Product Specification.
status: SOSI godkjent

NRL - Nasjonalt register over luftfartshindre distribusjon
type: Concept
in scheme: Produktspesifikasjoner
top concept of: Produktspesifikasjoner
definition: Dokumentet gir en detaljert beskrivelse av datasettet «Nasjonalt register over luftfartshindre» og er basert på standarden ISO 19131 Data Product Specification. Nasjonalt register over luftfartshindre - NRL inneholder luftfartshindre samlet inn som følge av «Forskrift om rapportering, registrering og merking av luftfartshindre».
description: Dokumentet gir en detaljert beskrivelse av datasettet «Nasjonalt register over luftfartshindre» og er basert på standarden ISO 19131 Data Product Specification. Nasjonalt register over luftfartshindre - NRL inneholder luftfartshindre samlet inn som følge av «Forskrift om rapportering, registrering og merking av luftfartshindre».
status: SOSI godkjent

FKB Bygning
type: Concept
in scheme: Produktspesifikasjoner
top concept of: Produktspesifikasjoner
definition: Dokumentet gir en detaljert beskrivelse av datasettet "FKB Bygning" og er basert på standarden ISO 19131 Data Product Specification
description: Dokumentet gir en detaljert beskrivelse av datasettet "FKB Bygning" og er basert på standarden ISO 19131 Data Product Specification
status: SOSI godkjent

Låssettingsplasser
type: Concept
in scheme: Produktspesifikasjoner
top concept of: Produktspesifikasjoner
definition: Dokumentet gir en detaljert beskrivelse av datasettet "Låssettingsplasser" og er basert på standarden ISO 19131 Data Product Specification
description: Dokumentet gir en detaljert beskrivelse av datasettet "Låssettingsplasser" og er basert på standarden ISO 19131 Data Product Specification
status: Tilbaketrukket

Reindrift - Konsesjonsområde
type: Concept
in scheme: Produktspesifikasjoner
top concept of: Produktspesifikasjoner
definition: Dokumentet gir en detaljert beskrivelse av datasettet "Reindrift - Reindriftsanlegg" og er basert på standarden ISO 19135 Data Product Specification.
description: Dokumentet gir en detaljert beskrivelse av datasettet "Reindrift - Reindriftsanlegg" og er basert på standarden ISO 19135 Data Product Specification.
status: SOSI godkjent

Jord- og flomskred aktsomhetsområder
type: Concept
in scheme: Produktspesifikasjoner
top concept of: Produktspesifikasjoner
definition: Dokumentet gir en detaljert beskrivelse av datasettet "Jord- og flomskred aktsomhetsområder" og er basert på standarden ISO 19131 Data Product Specification. Aktsomhetsområder for jord- og flomskred viser potensielle utløpsområder for alle typer løsmasseskred bortsett fra kvikkleireskred og store flomskred i slake elveløp.
description: Dokumentet gir en detaljert beskrivelse av datasettet "Jord- og flomskred aktsomhetsområder" og er basert på standarden ISO 19131 Data Product Specification. Aktsomhetsområder for jord- og flomskred viser potensielle utløpsområder for alle typer løsmasseskred bortsett fra kvikkleireskred og store flomskred i slake elveløp.
status: SOSI godkjent

Gyteområder
type: Concept
in scheme: Produktspesifikasjoner
top concept of: Produktspesifikasjoner
status: SOSI godkjent

FKB LedningVa
type: Concept
in scheme: Produktspesifikasjoner
top concept of: Produktspesifikasjoner
definition: Dokumentet gir en detaljert beskrivelse av datasettet "FKB LedningVA" og er basert på standarden ISO 19131 Data Product Specification
description: Dokumentet gir en detaljert beskrivelse av datasettet "FKB LedningVA" og er basert på standarden ISO 19131 Data Product Specification
status: Tilbaketrukket

Verdifulle kulturlandskap
type: Concept
in scheme: Produktspesifikasjoner
top concept of: Produktspesifikasjoner
definition: Dokumentet gir en detaljert beskrivelse av datasettet "Verdifulle kulturlandskap" og er basert på standarden ISO 19135 Data Product Specification. Datasettet viser forvaltningsmessig høyt prioriterte kulturlandskapsområder med både biologiske og kulturhistoriske verdier.
description: Dokumentet gir en detaljert beskrivelse av datasettet "Verdifulle kulturlandskap" og er basert på standarden ISO 19135 Data Product Specification. Datasettet viser forvaltningsmessig høyt prioriterte kulturlandskapsområder med både biologiske og kulturhistoriske verdier.
status: SOSI godkjent

Brannstasjoner
type: Concept
in scheme: Produktspesifikasjoner
top concept of: Produktspesifikasjoner
definition: Dokumentet gir en detaljert beskrivelse av datasettet "Brannstasjoner" og er basert på standarden ISO 19131 Data Product Specification.
description: Dokumentet gir en detaljert beskrivelse av datasettet "Brannstasjoner" og er basert på standarden ISO 19131 Data Product Specification.
status: SOSI godkjent

Reindrift - Reindriftsanlegg
type: Concept
in scheme: Produktspesifikasjoner
top concept of: Produktspesifikasjoner
definition: Dokumentet gir en detaljert beskrivelse av datasettet "Reindrift - Reindriftsanlegg" og er basert på standarden ISO 19135 Data Product Specification.
description: Dokumentet gir en detaljert beskrivelse av datasettet "Reindrift - Reindriftsanlegg" og er basert på standarden ISO 19135 Data Product Specification.
status: SOSI godkjent

Sedimentasjonsmiljø
type: Concept
in scheme: Produktspesifikasjoner
top concept of: Produktspesifikasjoner
definition: Dokumentet gir en detaljert beskrivelse av datasettet "Sedimentasjonsmiljø" og er basert på standarden ISO 19135 Data Product Specification
description: Dokumentet gir en detaljert beskrivelse av datasettet "Sedimentasjonsmiljø" og er basert på standarden ISO 19135 Data Product Specification
status: SOSI godkjent

Virksomhetsstatistikk på rutenett
type: Concept
in scheme: Produktspesifikasjoner
top concept of: Produktspesifikasjoner
definition: Dokumentet gir en detaljert beskrivelse av datasettet "Virksomhetsstatistikk på rutenett" og er basert på standarden ISO 19131 Data Product Specification
description: Dokumentet gir en detaljert beskrivelse av datasettet "Virksomhetsstatistikk på rutenett" og er basert på standarden ISO 19131 Data Product Specification
status: Utkast

Reindrift - Konvensjonsområde
type: Concept
in scheme: Produktspesifikasjoner
top concept of: Produktspesifikasjoner
definition: Dokumentet gir en detaljert beskrivelse av datasettet "Reindrift - Konvensjonsområde" og er basert på standarden ISO 19135 Data Product Specification.
description: Dokumentet gir en detaljert beskrivelse av datasettet "Reindrift - Konvensjonsområde" og er basert på standarden ISO 19135 Data Product Specification.
status: SOSI godkjent

Kartlagte og verdsatte friluftslivsområder
type: Concept
in scheme: Produktspesifikasjoner
top concept of: Produktspesifikasjoner
definition: Dokumentet gir en detaljert beskrivelse av datasettet "Kartlagte og verdsatte friluftslivsområder" og er basert på standarden ISO 19135 Data Product Specification
description: Dokumentet gir en detaljert beskrivelse av datasettet "Kartlagte og verdsatte friluftslivsområder" og er basert på standarden ISO 19135 Data Product Specification
status: SOSI godkjent

Kulturminner - Brannsmitteområder
type: Concept
in scheme: Produktspesifikasjoner
top concept of: Produktspesifikasjoner
definition: Produktspesifikasjonen beskriver datasettet Brannsmitteområder for det offentlige kartgrunnlaget
description: Produktspesifikasjonen beskriver datasettet Brannsmitteområder for det offentlige kartgrunnlaget
status: SOSI godkjent

Søppel pr. Mareano-stasjon
type: Concept
in scheme: Produktspesifikasjoner
top concept of: Produktspesifikasjoner
definition: Dokumentet gir en detaljert beskrivelse av datasettet og er basert på standarden ISO 19131 Data Product Specification.
description: Dokumentet gir en detaljert beskrivelse av datasettet og er basert på standarden ISO 19131 Data Product Specification.
status: SOSI godkjent

Radioaktivitet i marint miljø
type: Concept
in scheme: Produktspesifikasjoner
top concept of: Produktspesifikasjoner
status: Gyldig

Trafikkmengde
type: Concept
in scheme: Produktspesifikasjoner
top concept of: Produktspesifikasjoner
definition: Dokumentet gir en detaljert beskrivelse av datasettet "NVDB Trafikkmengde" og er basert på standarden ISO 19131 Data Product Specification. Datasettet gir informasjon om representativ trafikkmengde for en vegstrekning på europa-, rikt- eller fylkesveger.
description: Dokumentet gir en detaljert beskrivelse av datasettet "NVDB Trafikkmengde" og er basert på standarden ISO 19131 Data Product Specification. Datasettet gir informasjon om representativ trafikkmengde for en vegstrekning på europa-, rikt- eller fylkesveger.
status: SOSI godkjent

Kulturminner - Kulturmiljøer
type: Concept
in scheme: Produktspesifikasjoner
top concept of: Produktspesifikasjoner
definition: Produktspesifikasjonen beskriver datasettet Kulturmiljøer for det offentlige kartgrunnlaget.
description: Produktspesifikasjonen beskriver datasettet Kulturmiljøer for det offentlige kartgrunnlaget.
status: SOSI godkjent

N250 Kartdata
type: Concept
in scheme: Produktspesifikasjoner
top concept of: Produktspesifikasjoner
definition: Dokumentet gir en detaljert beskrivelse av datasettet «N250 Kartdata», og er basert på standarden ISO 19135 Data Product Specification.
description: Dokumentet gir en detaljert beskrivelse av datasettet «N250 Kartdata», og er basert på standarden ISO 19135 Data Product Specification.
status: SOSI godkjent

Matrikkelen - Bygningspunkt utvidet
type: Concept
in scheme: Produktspesifikasjoner
top concept of: Produktspesifikasjoner
definition: Datasettet inneholder et utdrag av bygningsinformasjonen som er registrert i Matrikkelen, Norges offisielle register over fast eiendom, herunder bygninger. Produktet inneholder data som krever brukerautentisering og tilgangskontroll (ref: Utleveringsforskriften § 4)
description: Datasettet inneholder et utdrag av bygningsinformasjonen som er registrert i Matrikkelen, Norges offisielle register over fast eiendom, herunder bygninger. Produktet inneholder data som krever brukerautentisering og tilgangskontroll (ref: Utleveringsforskriften § 4)
status: Tilbaketrukket

FKB Ledning
type: Concept
in scheme: Produktspesifikasjoner
top concept of: Produktspesifikasjoner
definition: Dokumentet gir en detaljert beskrivelse av datasettet "FKB Ledning" og er basert på standarden ISO 19131 Data Product Specification
description: Dokumentet gir en detaljert beskrivelse av datasettet "FKB Ledning" og er basert på standarden ISO 19131 Data Product Specification
status: SOSI godkjent

Arbeidsgiveravgiftsoner
type: Concept
in scheme: Produktspesifikasjoner
top concept of: Produktspesifikasjoner
definition: Dokumentet gir en detaljert beskrivelse av datasettet.
description: Dokumentet gir en detaljert beskrivelse av datasettet.
status: Gyldig

Reindrift - Oppsamlingsområde
type: Concept
in scheme: Produktspesifikasjoner
top concept of: Produktspesifikasjoner
definition: Dokumentet gir en detaljert beskrivelse av datasettet "Reindrift - Oppsamlingsområde" og er basert på standarden ISO 19135 Data Product Specification.
description: Dokumentet gir en detaljert beskrivelse av datasettet "Reindrift - Oppsamlingsområde" og er basert på standarden ISO 19135 Data Product Specification.
status: SOSI godkjent

Mareano bunnprøvestasjoner
type: Concept
in scheme: Produktspesifikasjoner
top concept of: Produktspesifikasjoner
definition: Dokumentet gir en detaljert beskrivelse av datasettet og er basert på standarden ISO 19131 Data Product Specification.
description: Dokumentet gir en detaljert beskrivelse av datasettet og er basert på standarden ISO 19131 Data Product Specification.
status: SOSI godkjent

DTM 10 Terrengmodell
type: Concept
in scheme: Produktspesifikasjoner
top concept of: Produktspesifikasjoner
definition: Dokumentet gir en detaljert beskrivelse av datasettet og er basert på standarden ISO 19131 Data Product Specification
description: Dokumentet gir en detaljert beskrivelse av datasettet og er basert på standarden ISO 19131 Data Product Specification
status: SOSI godkjent

Reindrift - Årstidsbeite - Vårbeite
type: Concept
in scheme: Produktspesifikasjoner
top concept of: Produktspesifikasjoner
definition: Dokumentet gir en detaljert beskrivelse av datasettet "Reindrift Vårbeite" og er basert på standarden ISO 19135 Data Product Specification.
description: Dokumentet gir en detaljert beskrivelse av datasettet "Reindrift Vårbeite" og er basert på standarden ISO 19135 Data Product Specification.
status: SOSI godkjent

Trafikkulykke
type: Concept
in scheme: Produktspesifikasjoner
top concept of: Produktspesifikasjoner
definition: Dokumentet gir en detaljert beskrivelse av datasettet "Trafikkulykke" og er basert på standarden ISO 19131 Data Product Specification. Datasettet beskriver alle trafikkulykker de siste 5 kalenderårene med personskader eller større materielle skader.
description: Dokumentet gir en detaljert beskrivelse av datasettet "Trafikkulykke" og er basert på standarden ISO 19131 Data Product Specification. Datasettet beskriver alle trafikkulykker de siste 5 kalenderårene med personskader eller større materielle skader.
status: SOSI godkjent

Brannalarmsentraler
type: Concept
in scheme: Produktspesifikasjoner
top concept of: Produktspesifikasjoner
definition: Dokumentet gir en detaljert beskrivelse av datasettet "Brannalarmsentraler" og er basert på standarden ISO 19131 Data Product Specification.
description: Dokumentet gir en detaljert beskrivelse av datasettet "Brannalarmsentraler" og er basert på standarden ISO 19131 Data Product Specification.
status: SOSI godkjent

Matrikkelen - Bygningspunkt
type: Concept
in scheme: Produktspesifikasjoner
top concept of: Produktspesifikasjoner
definition: Dokumentet gir en detaljert beskrivelse av datasettet "Matrikkelen - Bygningspunkt" og er basert på standarden ISO 19135 Data Product Specification
description: Dokumentet gir en detaljert beskrivelse av datasettet "Matrikkelen - Bygningspunkt" og er basert på standarden ISO 19135 Data Product Specification
status: SOSI godkjent

Skyteanlegg DFS
type: Concept
in scheme: Produktspesifikasjoner
top concept of: Produktspesifikasjoner
definition: Dokumentet gir en detaljert beskrivelse av datasettet "Skyteanlegg DFS" og er basert på standarden ISO 19131 Data Product Specification
description: Dokumentet gir en detaljert beskrivelse av datasettet "Skyteanlegg DFS" og er basert på standarden ISO 19131 Data Product Specification
status: Gyldig

FKB Ledning El (forvaltning)
type: Concept
in scheme: Produktspesifikasjoner
top concept of: Produktspesifikasjoner
definition: Dokumentet gir en detaljert beskrivelse av datasettet "FKB Ledning El (forvaltning)" og er basert på standarden ISO 19131 Data Product Specification
description: Dokumentet gir en detaljert beskrivelse av datasettet "FKB Ledning El (forvaltning)" og er basert på standarden ISO 19131 Data Product Specification
status: Tilbaketrukket

ISPS Havneanlegg
type: Concept
in scheme: Produktspesifikasjoner
top concept of: Produktspesifikasjoner
definition: Spesifikasjonen inneholder beskrivelse av havneanlegg som Kystverkets fører tilsyn med etter den såkalte ISPS koden. Denne omhandler havnesikring mot ytre trusler/terroranslag - http://www.imo.org/ourwork/security/instruments/pages/ispscode.aspx Objektene beskriver med ISPS status, hvilken type trafikk som går over havneanlegget samt en del forhold som for eksempel eierskap, myndighet m.v.
description: Spesifikasjonen inneholder beskrivelse av havneanlegg som Kystverkets fører tilsyn med etter den såkalte ISPS koden. Denne omhandler havnesikring mot ytre trusler/terroranslag - http://www.imo.org/ourwork/security/instruments/pages/ispscode.aspx Objektene beskriver med ISPS status, hvilken type trafikk som går over havneanlegget samt en del forhold som for eksempel eierskap, myndighet m.v.
status: Utkast

Berggrunn
type: Concept
in scheme: Produktspesifikasjoner
top concept of: Produktspesifikasjoner
definition: Dokumentet gir en detaljert beskrivelse av datasettet "Berggrunn" og er basert på standarden ISO 19131 Data Product Specification
description: Dokumentet gir en detaljert beskrivelse av datasettet "Berggrunn" og er basert på standarden ISO 19131 Data Product Specification
status: Utkast

Artsmangfold video-observerte Korallbunntyper
type: Concept
in scheme: Produktspesifikasjoner
top concept of: Produktspesifikasjoner
definition: Dokumentet gir en detaljert beskrivelse av datasettet og er basert på standarden ISO 19131 Data Product Specification.
description: Dokumentet gir en detaljert beskrivelse av datasettet og er basert på standarden ISO 19131 Data Product Specification.
status: SOSI godkjent

Bergrettigheter
type: Concept
in scheme: Produktspesifikasjoner
top concept of: Produktspesifikasjoner
definition: Dokumentet gir en detaljert beskrivelse av datasettet "Bergrettigheter" og er basert på standarden ISO 19131 Data Product Specification
description: Dokumentet gir en detaljert beskrivelse av datasettet "Bergrettigheter" og er basert på standarden ISO 19131 Data Product Specification
status: SOSI godkjent

Bunnsedimenter kornstørrelse
type: Concept
in scheme: Produktspesifikasjoner
top concept of: Produktspesifikasjoner
definition: Dokumentet gir en detaljert beskrivelse av datasettet "Bunnsedimenter kornstørrelse" og er basert på standarden ISO 19131 Data Product Specification
description: Dokumentet gir en detaljert beskrivelse av datasettet "Bunnsedimenter kornstørrelse" og er basert på standarden ISO 19131 Data Product Specification
status: SOSI godkjent

Grunnskoler og videregående skoler
type: Concept
in scheme: Produktspesifikasjoner
top concept of: Produktspesifikasjoner
definition: Dokumentet gir en detaljert beskrivelse av datasettet og er basert på standarden ISO 19131 Data Product Specification.
description: Dokumentet gir en detaljert beskrivelse av datasettet og er basert på standarden ISO 19131 Data Product Specification.
status: Gyldig

Sentrumssoner
type: Concept
in scheme: Produktspesifikasjoner
top concept of: Produktspesifikasjoner
definition: Dokumentet gir en detaljert beskrivelse av datasettet "Sentrumssoner" og er basert på standarden ISO 19131 Data Product Specification
description: Dokumentet gir en detaljert beskrivelse av datasettet "Sentrumssoner" og er basert på standarden ISO 19131 Data Product Specification
status: SOSI godkjent

Verneplan for vassdrag
type: Concept
in scheme: Produktspesifikasjoner
top concept of: Produktspesifikasjoner
definition: Dokumentet gir en detaljert beskrivelse av datasettet "Verneplan for vassdrag" og er basert på standarden ISO 19131 Data Product Specification
description: Dokumentet gir en detaljert beskrivelse av datasettet "Verneplan for vassdrag" og er basert på standarden ISO 19131 Data Product Specification
status: SOSI godkjent

FKB Tekst1000
type: Concept
in scheme: Produktspesifikasjoner
top concept of: Produktspesifikasjoner
definition: Dokumentet gir en detaljert beskrivelse av datasettet "FKB Tekst1000" og er basert på standarden ISO 19135 Data Product Specification
description: Dokumentet gir en detaljert beskrivelse av datasettet "FKB Tekst1000" og er basert på standarden ISO 19135 Data Product Specification
status: Tilbaketrukket

J100 Kartdata
type: Concept
in scheme: Produktspesifikasjoner
top concept of: Produktspesifikasjoner
definition: Dokumentet gir en detaljert beskrivelse av datasettet "J100 Kartdata" og er basert på standarden ISO 19135 Data Product Specification
description: Dokumentet gir en detaljert beskrivelse av datasettet "J100 Kartdata" og er basert på standarden ISO 19135 Data Product Specification
status: Utkast

Kulturminner - Lokaliteter
type: Concept
in scheme: Produktspesifikasjoner
top concept of: Produktspesifikasjoner
definition: Produktspesifikasjonen beskriver datasettet Lokaliteter for det offentlige kartgrunnlaget
description: Produktspesifikasjonen beskriver datasettet Lokaliteter for det offentlige kartgrunnlaget
status: SOSI godkjent

Norsk vann - Innmålt geometri for anlegg som bygges
type: Concept
in scheme: Produktspesifikasjoner
top concept of: Produktspesifikasjoner
definition: Dokumentet gir en detaljert beskrivelse av datasettet og er basert på standarden ISO 19131 Data Product Specification
description: Dokumentet gir en detaljert beskrivelse av datasettet og er basert på standarden ISO 19131 Data Product Specification
status: SOSI godkjent

Tilfluktsrom - offentlige
type: Concept
in scheme: Produktspesifikasjoner
top concept of: Produktspesifikasjoner
definition: Dokumentet gir en detaljert beskrivelse av datasettet og er basert på standarden ISO 19131 Data Product Specification
description: Dokumentet gir en detaljert beskrivelse av datasettet og er basert på standarden ISO 19131 Data Product Specification
status: SOSI godkjent

Tilgjengelighet
type: Concept
in scheme: Produktspesifikasjoner
top concept of: Produktspesifikasjoner
definition: Dokumentet gir en detaljert beskrivelse av datasettet og er basert på standarden ISO 19131 Data Product Specification.
description: Dokumentet gir en detaljert beskrivelse av datasettet og er basert på standarden ISO 19131 Data Product Specification.
status: SOSI godkjent

Byggeforbudssoner kraftledninger
type: Concept
in scheme: Produktspesifikasjoner
top concept of: Produktspesifikasjoner
definition: Dokumentet gir en detaljert beskrivelse av datasettet og er basert på standarden ISO 19131 Data Product Specification
description: Dokumentet gir en detaljert beskrivelse av datasettet og er basert på standarden ISO 19131 Data Product Specification
status: SOSI godkjent

Flomsoner
type: Concept
in scheme: Produktspesifikasjoner
top concept of: Produktspesifikasjoner
definition: Dokumentet gir en detaljert beskrivelse av datasettet "Flomsoner" og er basert på standarden ISO 19135 Data Product Specification. Flomsoner viser arealer som oversvømmes ved ulike flomstørrelser (gjentaksintervall). Det blir utarbeidet flomsoner for 20-, 200- og 1000-årsflommene.
description: Dokumentet gir en detaljert beskrivelse av datasettet "Flomsoner" og er basert på standarden ISO 19135 Data Product Specification. Flomsoner viser arealer som oversvømmes ved ulike flomstørrelser (gjentaksintervall). Det blir utarbeidet flomsoner for 20-, 200- og 1000-årsflommene.
status: SOSI godkjent

Reindrift - Samebyrettsavgjørelse
type: Concept
in scheme: Produktspesifikasjoner
top concept of: Produktspesifikasjoner
definition: Dokumentet gir en detaljert beskrivelse av datasettet "Reindrift - Samebyrettsavgjørelse" og er basert på standarden ISO 19135 Data Product Specification." og er basert på standarden ISO 19135 Data Product Specification.
description: Dokumentet gir en detaljert beskrivelse av datasettet "Reindrift - Samebyrettsavgjørelse" og er basert på standarden ISO 19135 Data Product Specification." og er basert på standarden ISO 19135 Data Product Specification.
status: SOSI godkjent

Kulturminner - Lokaliteter, Enkeltminner og Sikringssoner
type: Concept
in scheme: Produktspesifikasjoner
top concept of: Produktspesifikasjoner
definition: Dokumentet gir en detaljert beskrivelse av datasettet og er basert på standarden ISO 19131 Data Product Specification.
description: Dokumentet gir en detaljert beskrivelse av datasettet og er basert på standarden ISO 19131 Data Product Specification.
status: SOSI godkjent

Kulturminner - Freda bygninger
type: Concept
in scheme: Produktspesifikasjoner
top concept of: Produktspesifikasjoner
definition: Produktspesifikasjonen beskriver datasettet Freda bygninger for det offentlige kartgrunnlaget
description: Produktspesifikasjonen beskriver datasettet Freda bygninger for det offentlige kartgrunnlaget
status: SOSI godkjent

Snø- og steinskred - aktsomhetsområder
type: Concept
in scheme: Produktspesifikasjoner
top concept of: Produktspesifikasjoner
definition: Dokumentet gir en detaljert beskrivelse av datasettet "Snø- og steinskred - aktsomhetsområder" og er basert på standarden ISO 19131 Data Product Specification. Aktsomhetsområdene for snø- og steinskred viser aktsomhetsområder samlet for de to skredtypene.
description: Dokumentet gir en detaljert beskrivelse av datasettet "Snø- og steinskred - aktsomhetsområder" og er basert på standarden ISO 19131 Data Product Specification. Aktsomhetsområdene for snø- og steinskred viser aktsomhetsområder samlet for de to skredtypene.
status: SOSI godkjent

Nasjonale laksefjorder
type: Concept
in scheme: Produktspesifikasjoner
top concept of: Produktspesifikasjoner
definition: Dokumentet gir en detaljert beskrivelse av datasettet og er basert på standarden ISO 19131 Data Product Specification.
description: Dokumentet gir en detaljert beskrivelse av datasettet og er basert på standarden ISO 19131 Data Product Specification.
status: Utkast

Reindrift - Årstidsbeite - Vinterbeite
type: Concept
in scheme: Produktspesifikasjoner
top concept of: Produktspesifikasjoner
definition: Dokumentet gir en detaljert beskrivelse av datasettet "Reindrift - Vinterbeite" og er basert på standarden ISO 19135 Data Product Specification.
description: Dokumentet gir en detaljert beskrivelse av datasettet "Reindrift - Vinterbeite" og er basert på standarden ISO 19135 Data Product Specification.
status: SOSI godkjent

Tungmetaller og andre uorganiske miljøelementer i marine sedimenter
type: Concept
in scheme: Produktspesifikasjoner
top concept of: Produktspesifikasjoner
definition: Dokumentet gir en detaljert beskrivelse av datasettet "Tungmetaller og andre uorganiske miljøelementer i marine sedimenter"
description: Dokumentet gir en detaljert beskrivelse av datasettet "Tungmetaller og andre uorganiske miljøelementer i marine sedimenter"
status: Utkast

Reindrift - Årstidsbeite - Høstvinterbeite
type: Concept
in scheme: Produktspesifikasjoner
top concept of: Produktspesifikasjoner
definition: Dokumentet gir en detaljert beskrivelse av datasettet "Reindrift - Høstvinterbeite" og er basert på standarden ISO 19135 Data Product Specification.
description: Dokumentet gir en detaljert beskrivelse av datasettet "Reindrift - Høstvinterbeite" og er basert på standarden ISO 19135 Data Product Specification.
status: SOSI godkjent

NRL - Nasjonalt register over luftfartshindre rapportering
type: Concept
in scheme: Produktspesifikasjoner
top concept of: Produktspesifikasjoner
status: SOSI godkjent

Fastmerker
type: Concept
in scheme: Produktspesifikasjoner
top concept of: Produktspesifikasjoner
status: Gyldig

N1000 Kartdata
type: Concept
in scheme: Produktspesifikasjoner
top concept of: Produktspesifikasjoner
definition: Dokumentet gir en detaljert beskrivelse av datasettet "N1000 Kartdata" og er basert på standarden ISO 19135 Data Product Specification
description: Dokumentet gir en detaljert beskrivelse av datasettet "N1000 Kartdata" og er basert på standarden ISO 19135 Data Product Specification
status: SOSI godkjent

Viktige naturtyper
type: Concept
in scheme: Produktspesifikasjoner
top concept of: Produktspesifikasjoner
definition: Dokumentet gir en detaljert beskrivelse av datasettet "Viktige naturtyper" og er basert på standarden ISO 19131 Data Product Specification. Datasettet viser forekomster av naturtyper som er vurdert som svært viktige (A), viktige (B) og lokalt viktige (C) for biologisk mangfold.
description: Dokumentet gir en detaljert beskrivelse av datasettet "Viktige naturtyper" og er basert på standarden ISO 19131 Data Product Specification. Datasettet viser forekomster av naturtyper som er vurdert som svært viktige (A), viktige (B) og lokalt viktige (C) for biologisk mangfold.
status: Tilbaketrukket

Mareanoprøver - Artsmangfold, individer og biomasse
type: Concept
in scheme: Produktspesifikasjoner
top concept of: Produktspesifikasjoner
status: SOSI godkjent

FKB Vann
type: Concept
in scheme: Produktspesifikasjoner
top concept of: Produktspesifikasjoner
definition: Dokumentet gir en detaljert beskrivelse av datasettet "FKB Vann" og er basert på standarden ISO 19131 Data Product Specification
description: Dokumentet gir en detaljert beskrivelse av datasettet "FKB Vann" og er basert på standarden ISO 19131 Data Product Specification
status: SOSI godkjent

IUA - Interkommunale Utvalg mot Akutt forurensning
type: Concept
in scheme: Produktspesifikasjoner
top concept of: Produktspesifikasjoner
definition: Dokumentet gir en detaljert beskrivelse av datasettet "IUA - Interkommunale Utvalg mot Akutt forurensning" og er basert på standarden ISO 19131 Data Product Specification
description: Dokumentet gir en detaljert beskrivelse av datasettet "IUA - Interkommunale Utvalg mot Akutt forurensning" og er basert på standarden ISO 19131 Data Product Specification
status: Utkast

Norsk Vann - Ledningsdata for prosjektering og eksisterende anlegg
type: Concept
in scheme: Produktspesifikasjoner
top concept of: Produktspesifikasjoner
definition: Dokumentet gir en detaljert beskrivelse av datasettet og er basert på standarden ISO 19131 Data Product Specification
description: Dokumentet gir en detaljert beskrivelse av datasettet og er basert på standarden ISO 19131 Data Product Specification
status: SOSI godkjent

Kulturminner - Verneverdig tette trehusmiljøer
type: Concept
in scheme: Produktspesifikasjoner
top concept of: Produktspesifikasjoner
definition: Produktspesifikasjonen beskriver datasettet Verneverdig tette trehusmiljøer for det offentlige kartgrunnlaget
description: Produktspesifikasjonen beskriver datasettet Verneverdig tette trehusmiljøer for det offentlige kartgrunnlaget
status: SOSI godkjent

N100 Kartdata
type: Concept
in scheme: Produktspesifikasjoner
top concept of: Produktspesifikasjoner
definition: Dokumentet gir en detaljert beskrivelse av datasettet og er basert på standarden ISO 19131 Data Product Specification
description: Dokumentet gir en detaljert beskrivelse av datasettet og er basert på standarden ISO 19131 Data Product Specification
status: SOSI godkjent

Nødhavner
type: Concept
in scheme: Produktspesifikasjoner
top concept of: Produktspesifikasjoner
definition: Spesifikasjonen inneholder beskrivelse av Kystverkets forhåndsevaluerte nødhavnlokaliteter som inngår i Kystverkets beredskapsplanverk. Disse lokalitetene vurderes som de mest aktuelle stedene å anbringe fartøy i nød for å unngå eller begrense akutt forurensning. Dataene utgjør en del av Kystverkets beslutningsstøtteverktøy til bruk i situasjoner med fare for, eller inntrådt, akutt forurensning. I den enkelte situasjon er likevel ethvert sted en mulig nødhavn.
description: Spesifikasjonen inneholder beskrivelse av Kystverkets forhåndsevaluerte nødhavnlokaliteter som inngår i Kystverkets beredskapsplanverk. Disse lokalitetene vurderes som de mest aktuelle stedene å anbringe fartøy i nød for å unngå eller begrense akutt forurensning. Dataene utgjør en del av Kystverkets beslutningsstøtteverktøy til bruk i situasjoner med fare for, eller inntrådt, akutt forurensning. I den enkelte situasjon er likevel ethvert sted en mulig nødhavn.
status: Utkast

Punktsky
type: Concept
in scheme: Produktspesifikasjoner
top concept of: Produktspesifikasjoner
definition: Dokumentet gir en detaljert beskrivelse av datasettet og er basert på standarden ISO 19131 Data Product Specification
description: Dokumentet gir en detaljert beskrivelse av datasettet og er basert på standarden ISO 19131 Data Product Specification
status: SOSI godkjent

N50 Raster
type: Concept
in scheme: Produktspesifikasjoner
top concept of: Produktspesifikasjoner
definition: Dokumentet gir en detaljert beskrivelse av datasettet «N50 Raster»
description: Dokumentet gir en detaljert beskrivelse av datasettet «N50 Raster»
status: Gyldig

Norsk Vann - Anlegg som skal måles inn og stikningsdata
type: Concept
in scheme: Produktspesifikasjoner
top concept of: Produktspesifikasjoner
definition: Dokumentet gir en detaljert beskrivelse av datasettet og er basert på standarden ISO 19131 Data Product Specification
description: Dokumentet gir en detaljert beskrivelse av datasettet og er basert på standarden ISO 19131 Data Product Specification
status: SOSI godkjent

Eksplosivanlegg
type: Concept
in scheme: Produktspesifikasjoner
top concept of: Produktspesifikasjoner
definition: Dokumentet gir en detaljert beskrivelse av datasettet "Eksplosivanlegg" og er basert på standarden ISO 19131 Data Product Specification
description: Dokumentet gir en detaljert beskrivelse av datasettet "Eksplosivanlegg" og er basert på standarden ISO 19131 Data Product Specification
status: SOSI godkjent

FKB Naturinfo
type: Concept
in scheme: Produktspesifikasjoner
top concept of: Produktspesifikasjoner
definition: Dokumentet gir en detaljert beskrivelse av datasettet "FKB Naturinfo" og er basert på standarden ISO 19131 Data Product Specification
description: Dokumentet gir en detaljert beskrivelse av datasettet "FKB Naturinfo" og er basert på standarden ISO 19131 Data Product Specification
status: SOSI godkjent

Kulturlandskap - utvalgte
type: Concept
in scheme: Produktspesifikasjoner
top concept of: Produktspesifikasjoner
definition: Dokumentet gir en detaljert beskrivelse av datasettet og er basert på standarden ISO 19131 Data Product Specification.
description: Dokumentet gir en detaljert beskrivelse av datasettet og er basert på standarden ISO 19131 Data Product Specification.
status: SOSI godkjent

Forsvarets skyte- og øvingsfelt land
type: Concept
in scheme: Produktspesifikasjoner
top concept of: Produktspesifikasjoner
definition: Dokumentet gir en detaljert beskrivelse av datasettet og er basert på standarden ISO 19131 Data Product Specification.
description: Dokumentet gir en detaljert beskrivelse av datasettet og er basert på standarden ISO 19131 Data Product Specification.
status: SOSI godkjent

Tare - høstefelt
type: Concept
in scheme: Produktspesifikasjoner
top concept of: Produktspesifikasjoner
definition: Dokumentet gir en detaljert beskrivelse av datasettet og er basert på standarden ISO 19131 Data Product Specification.
description: Dokumentet gir en detaljert beskrivelse av datasettet og er basert på standarden ISO 19131 Data Product Specification.
status: Utkast

Reindrift - Siidaområde
type: Concept
in scheme: Produktspesifikasjoner
top concept of: Produktspesifikasjoner
definition: Dokumentet gir en detaljert beskrivelse av datasettet "Reindrift - Siidaområde" og er basert på standarden ISO 19135 Data Product Specification.
description: Dokumentet gir en detaljert beskrivelse av datasettet "Reindrift - Siidaområde" og er basert på standarden ISO 19135 Data Product Specification.
status: SOSI godkjent

Militære forbudsområder innen Sjøforsvaret
type: Concept
in scheme: Produktspesifikasjoner
top concept of: Produktspesifikasjoner
definition: Dokumentet gir en detaljert beskrivelse av datasettet og er basert på standarden ISO 19131 Data Product Specification.
description: Dokumentet gir en detaljert beskrivelse av datasettet og er basert på standarden ISO 19131 Data Product Specification.
status: Utkast

Statlige planretningslinjer for differensiert forvaltning av strandsonen langs sjøen
type: Concept
in scheme: Produktspesifikasjoner
top concept of: Produktspesifikasjoner
definition: Dokumentet gir en detaljert beskrivelse av datasettet "Statlige planretningslinjer for differensiert forvaltning av strandsonen langs sjøen" og er basert på standarden ISO 19135 Data Product Specification
description: Dokumentet gir en detaljert beskrivelse av datasettet "Statlige planretningslinjer for differensiert forvaltning av strandsonen langs sjøen" og er basert på standarden ISO 19135 Data Product Specification
status: SOSI godkjent

Små vannverk
type: Concept
in scheme: Produktspesifikasjoner
top concept of: Produktspesifikasjoner
definition: Dokumentet gir en detaljert beskrivelse av datasettet "Små vannverk" og er basert på standarden ISO 19131 Data Product Specification
description: Dokumentet gir en detaljert beskrivelse av datasettet "Små vannverk" og er basert på standarden ISO 19131 Data Product Specification
status: Gyldig

Reindrift - Samebyavtale
type: Concept
in scheme: Produktspesifikasjoner
top concept of: Produktspesifikasjoner
definition: Dokumentet gir en detaljert beskrivelse av datasettet "Reindrift - Samebyavtale" og er basert på standarden ISO 19135 Data Product Specification.
description: Dokumentet gir en detaljert beskrivelse av datasettet "Reindrift - Samebyavtale" og er basert på standarden ISO 19135 Data Product Specification.
status: SOSI godkjent

Fiskeplasser - redskap
type: Concept
in scheme: Produktspesifikasjoner
top concept of: Produktspesifikasjoner
definition: Dokumentet gir en detaljert beskrivelse av datasettet og er basert på standarden ISO 19131 Data Product Specification.
description: Dokumentet gir en detaljert beskrivelse av datasettet og er basert på standarden ISO 19131 Data Product Specification.
status: Utkast

NVDB Vegnett Pluss
type: Concept
in scheme: Produktspesifikasjoner
top concept of: Produktspesifikasjoner
status: SOSI godkjent

SsbArealbruk
type: Concept
in scheme: Produktspesifikasjoner
top concept of: Produktspesifikasjoner
definition: Dokumentet gir en detaljert beskrivelse av datasettet "SsbArealbruk" og er basert på standarden ISO 19131 Data Product Specification
description: Dokumentet gir en detaljert beskrivelse av datasettet "SsbArealbruk" og er basert på standarden ISO 19131 Data Product Specification
status: SOSI godkjent

Snøskred - aktsomhetsområder
type: Concept
in scheme: Produktspesifikasjoner
top concept of: Produktspesifikasjoner
definition: Dokumentet gir en detaljert beskrivelse av datasettet "Snøskred - aktsomhetsområder" og er basert på standarden ISO 19131 Data Product Specification. Aktsomhetsområder for snøskred er en nasjonalt dekkende kartserie som viser potensielt snøskredutsatte områder på oversiktsnivå. Kartene viser potensielle løsneområder og utløpsområder for snøskred.
description: Dokumentet gir en detaljert beskrivelse av datasettet "Snøskred - aktsomhetsområder" og er basert på standarden ISO 19131 Data Product Specification. Aktsomhetsområder for snøskred er en nasjonalt dekkende kartserie som viser potensielt snøskredutsatte områder på oversiktsnivå. Kartene viser potensielle løsneområder og utløpsområder for snøskred.
status: SOSI godkjent

Gravplass
type: Concept
in scheme: Produktspesifikasjoner
top concept of: Produktspesifikasjoner
definition: Dokumentet gir en detaljert beskrivelse av datasettet "Gravplass" og er basert på standarden ISO 19131 Data Product Specification
description: Dokumentet gir en detaljert beskrivelse av datasettet "Gravplass" og er basert på standarden ISO 19131 Data Product Specification
status: SOSI godkjent

Aktsomhetskart for snøskred
type: Concept
in scheme: Produktspesifikasjoner
top concept of: Produktspesifikasjoner
status: SOSI godkjent

Reindrift - Reinbeiteområde
type: Concept
in scheme: Produktspesifikasjoner
top concept of: Produktspesifikasjoner
definition: Dokumentet gir en detaljert beskrivelse av datasettet "Reindrift-Reinbeiteområde" og er basert på standarden ISO 19135 Data Product Specification.
description: Dokumentet gir en detaljert beskrivelse av datasettet "Reindrift-Reinbeiteområde" og er basert på standarden ISO 19135 Data Product Specification.
status: SOSI godkjent

Mareano referansestasjoner
type: Concept
in scheme: Produktspesifikasjoner
top concept of: Produktspesifikasjoner
definition: Dokumentet gir en detaljert beskrivelse av datasettet og er basert på standarden ISO 19131 Data Product Specification.
description: Dokumentet gir en detaljert beskrivelse av datasettet og er basert på standarden ISO 19131 Data Product Specification.
status: SOSI godkjent

Dyrkingspotensial
type: Concept
in scheme: Produktspesifikasjoner
top concept of: Produktspesifikasjoner
definition: Dokumentet gir en detaljert beskrivelse av datasettet "Dyrkingspotensial" og er basert på standarden ISO 19131 Data Product Specification
description: Dokumentet gir en detaljert beskrivelse av datasettet "Dyrkingspotensial" og er basert på standarden ISO 19131 Data Product Specification
status: Utkast

Lufthavn EL
type: Concept
in scheme: Produktspesifikasjoner
top concept of: Produktspesifikasjoner
definition: Dokumentet gir en detaljert beskrivelse av datasettet "Lufthavn EL" og er basert på standarden ISO 19131 Data Product Specification
description: Dokumentet gir en detaljert beskrivelse av datasettet "Lufthavn EL" og er basert på standarden ISO 19131 Data Product Specification
status: Utkast

Matrikkelen - Adresse
type: Concept
in scheme: Produktspesifikasjoner
top concept of: Produktspesifikasjoner
definition: Dokumentet gir en detaljert beskrivelse av datasettet "Matrikkelen - Adresse" og er basert på standarden ISO 19135 Data Product Specification
description: Dokumentet gir en detaljert beskrivelse av datasettet "Matrikkelen - Adresse" og er basert på standarden ISO 19135 Data Product Specification
status: SOSI godkjent

Mareano - videostasjoner
type: Concept
in scheme: Produktspesifikasjoner
top concept of: Produktspesifikasjoner
definition: Dokumentet gir en detaljert beskrivelse av datasettet og er basert på standarden ISO 19131 Data Product Specification.
description: Dokumentet gir en detaljert beskrivelse av datasettet og er basert på standarden ISO 19131 Data Product Specification.
status: SOSI godkjent

Vbase
type: Concept
in scheme: Produktspesifikasjoner
top concept of: Produktspesifikasjoner
definition: Dokumentet gir en detaljert beskrivelse av datasettet «Vbase», og er basert på standarden ISO 19131 Data Product Specification
description: Dokumentet gir en detaljert beskrivelse av datasettet «Vbase», og er basert på standarden ISO 19131 Data Product Specification
status: SOSI godkjent

Befolkning på rutenett
type: Concept
in scheme: Produktspesifikasjoner
top concept of: Produktspesifikasjoner
definition: Dokumentet gir en detaljert beskrivelse av datasettet "Befolkning på rutenett" og er basert på standarden ISO 19131 Data Product Specification
description: Dokumentet gir en detaljert beskrivelse av datasettet "Befolkning på rutenett" og er basert på standarden ISO 19131 Data Product Specification
status: Gyldig

Landformer (marin)
type: Concept
in scheme: Produktspesifikasjoner
top concept of: Produktspesifikasjoner
definition: Dokumentet gir en detaljert beskrivelse av datasettet "Landformer (marin)" og er basert på standarden ISO 19135 Data Product Specification
description: Dokumentet gir en detaljert beskrivelse av datasettet "Landformer (marin)" og er basert på standarden ISO 19135 Data Product Specification
status: Utkast

N5 Kartdata
type: Concept
in scheme: Produktspesifikasjoner
top concept of: Produktspesifikasjoner
definition: Dokumentet gir en detaljert beskrivelse av datasettet "N5 Kartdata" og er basert på standarden ISO 19135 Data Product Specification
description: Dokumentet gir en detaljert beskrivelse av datasettet "N5 Kartdata" og er basert på standarden ISO 19135 Data Product Specification
status: Gyldig

FKB Høydekurve
type: Concept
in scheme: Produktspesifikasjoner
top concept of: Produktspesifikasjoner
definition: Dokumentet gir en detaljert beskrivelse av datasettet "FKB Høydekurve" og er basert på standarden ISO 19131 Data Product Specification
description: Dokumentet gir en detaljert beskrivelse av datasettet "FKB Høydekurve" og er basert på standarden ISO 19131 Data Product Specification
status: SOSI godkjent

Havnedata
type: Concept
in scheme: Produktspesifikasjoner
top concept of: Produktspesifikasjoner
definition: Havnedata er detaljert geografisk informasjon om havner/kaier og tilhørende objekter.
description: Havnedata er detaljert geografisk informasjon om havner/kaier og tilhørende objekter.
status: SOSI godkjent

Steinsprang - aktsomhetsområder
type: Concept
in scheme: Produktspesifikasjoner
top concept of: Produktspesifikasjoner
definition: Dokumentet gir en detaljert beskrivelse av datasettet "Steinsprang - aktsomhetsområder" og er basert på standarden ISO 19131 Data Product Specification. Aktsomhetsområder for steinsprang er en nasjonalt dekkende kartserie som viser potensielt steinsprangutsatte områder på oversiktsnivå.
description: Dokumentet gir en detaljert beskrivelse av datasettet "Steinsprang - aktsomhetsområder" og er basert på standarden ISO 19131 Data Product Specification. Aktsomhetsområder for steinsprang er en nasjonalt dekkende kartserie som viser potensielt steinsprangutsatte områder på oversiktsnivå.
status: SOSI godkjent

Støysoner for Forsvarets skyte- og øvingsfelt
type: Concept
in scheme: Produktspesifikasjoner
top concept of: Produktspesifikasjoner
definition: Spesifikasjonen beskriver soner for Forsvarets skyte- og øvingsfelt, beregnet ut i fra retningslinje for behandling av støy i arealplanlegging.
description: Spesifikasjonen beskriver soner for Forsvarets skyte- og øvingsfelt, beregnet ut i fra retningslinje for behandling av støy i arealplanlegging.
status: SOSI godkjent

FKB Servitutt
type: Concept
in scheme: Produktspesifikasjoner
top concept of: Produktspesifikasjoner
definition: Dokumentet gir en detaljert beskrivelse av datasettet "FKB Servitutt" og er basert på standarden ISO 19131 Data Product Specification
description: Dokumentet gir en detaljert beskrivelse av datasettet "FKB Servitutt" og er basert på standarden ISO 19131 Data Product Specification
status: SOSI godkjent

Primærdata kystkontur
type: Concept
in scheme: Produktspesifikasjoner
top concept of: Produktspesifikasjoner
definition: Primærdata kystkontur definerer grense mellom sjø og land til bruk i alle Statens kartverks produkter
description: Primærdata kystkontur definerer grense mellom sjø og land til bruk i alle Statens kartverks produkter
status: Utkast

Artsmangfold – Videoobservasjoner
type: Concept
in scheme: Produktspesifikasjoner
top concept of: Produktspesifikasjoner
definition: Dokumentet gir en detaljert beskrivelse av datasettet og er basert på standarden ISO 19131 Data Product Specification.
description: Dokumentet gir en detaljert beskrivelse av datasettet og er basert på standarden ISO 19131 Data Product Specification.
status: SOSI godkjent

Motorferdsel i utmark
type: Concept
in scheme: Produktspesifikasjoner
top concept of: Produktspesifikasjoner
definition: Motorferdsel i utmark - snøscooter- og barmarksløyper. Dokumentet gir en detaljert beskrivelse av datasettet "Motorferdsel i utmark" og er basert på standarden ISO 19131 Data Product Specification.
description: Motorferdsel i utmark - snøscooter- og barmarksløyper. Dokumentet gir en detaljert beskrivelse av datasettet "Motorferdsel i utmark" og er basert på standarden ISO 19131 Data Product Specification.
status: SOSI godkjent

Norsk Vann - Ledningsdata for eksisterende anlegg
type: Concept
in scheme: Produktspesifikasjoner
top concept of: Produktspesifikasjoner
definition: Dokumentet gir en detaljert beskrivelse av datasettet og er basert på standarden ISO 19131 Data Product Specification
description: Dokumentet gir en detaljert beskrivelse av datasettet og er basert på standarden ISO 19131 Data Product Specification
status: SOSI godkjent

Sivilforsvarsdistrikter
type: Concept
in scheme: Produktspesifikasjoner
top concept of: Produktspesifikasjoner
definition: Dokumentet gir en detaljert beskrivelse av datasettet "Sivilforsvarsdistrikter" og er basert på standarden ISO 19131 Data Product Specification.
description: Dokumentet gir en detaljert beskrivelse av datasettet "Sivilforsvarsdistrikter" og er basert på standarden ISO 19131 Data Product Specification.
status: SOSI godkjent

Rutenett
type: Concept
in scheme: Produktspesifikasjoner
top concept of: Produktspesifikasjoner
definition: Dokumentet gir en detaljert beskrivelse av datasettet "Rutenett" og er basert på standarden ISO 19131 Data Product Specification
description: Dokumentet gir en detaljert beskrivelse av datasettet "Rutenett" og er basert på standarden ISO 19131 Data Product Specification
status: SOSI godkjent

Akvakultur - lokaliteter
type: Concept
in scheme: Produktspesifikasjoner
top concept of: Produktspesifikasjoner
definition: Dokumentet gir en detaljert beskrivelse av datasettet "Akvakultur - lokaliteter" og er basert på standarden ISO 19131 Data Product Specification
description: Dokumentet gir en detaljert beskrivelse av datasettet "Akvakultur - lokaliteter" og er basert på standarden ISO 19131 Data Product Specification
status: Gyldig

FKB TraktorvegSti
type: Concept
in scheme: Produktspesifikasjoner
top concept of: Produktspesifikasjoner
definition: Dokumentet gir en detaljert beskrivelse av datasettet "FKB TraktorvegSti" og er basert på standarden ISO 19131 Data Product Specification
description: Dokumentet gir en detaljert beskrivelse av datasettet "FKB TraktorvegSti" og er basert på standarden ISO 19131 Data Product Specification
status: SOSI godkjent

Norsk Vann - Ledningsdata AsBuilt
type: Concept
in scheme: Produktspesifikasjoner
top concept of: Produktspesifikasjoner
definition: Dokumentet gir en detaljert beskrivelse av datasettet og er basert på standarden ISO 19131 Data Product Specification
description: Dokumentet gir en detaljert beskrivelse av datasettet og er basert på standarden ISO 19131 Data Product Specification
status: SOSI godkjent

Mareano bunnprøver linjer
type: Concept
in scheme: Produktspesifikasjoner
top concept of: Produktspesifikasjoner
definition: Dokumentet gir en detaljert beskrivelse av datasettet og er basert på standarden ISO 19131 Data Product Specification.
description: Dokumentet gir en detaljert beskrivelse av datasettet og er basert på standarden ISO 19131 Data Product Specification.
status: SOSI godkjent

Skredfaresoner
type: Concept
in scheme: Produktspesifikasjoner
top concept of: Produktspesifikasjoner
definition: Dokumentet gir en detaljert beskrivelse av datasettet "Skredfaresoner" og er basert på standarden ISO 19131 Data Product Specification. Plan for skredfarekartlegging legger grunnlaget for prioriteringene med hensyn på farekartlegging for ulike typer skred.
description: Dokumentet gir en detaljert beskrivelse av datasettet "Skredfaresoner" og er basert på standarden ISO 19131 Data Product Specification. Plan for skredfarekartlegging legger grunnlaget for prioriteringene med hensyn på farekartlegging for ulike typer skred.
status: SOSI godkjent

Naturtyper - DN-håndbok 13
type: Concept
in scheme: Produktspesifikasjoner
top concept of: Produktspesifikasjoner
definition: Dokumentet gir en detaljert beskrivelse av datasettet "Naturtyper - DN-håndbok 13" og er basert på standarden ISO 19131 Data Product Specification
description: Dokumentet gir en detaljert beskrivelse av datasettet "Naturtyper - DN-håndbok 13" og er basert på standarden ISO 19131 Data Product Specification
status: SOSI godkjent

Statlig sikra friluftslivsområder
type: Concept
in scheme: Produktspesifikasjoner
top concept of: Produktspesifikasjoner
definition: Dokumentet gir en detaljert beskrivelse av datasettet "Statlig sikra friluftslivsområder" og er basert på standarden ISO 19135 Data Product Specification
description: Dokumentet gir en detaljert beskrivelse av datasettet "Statlig sikra friluftslivsområder" og er basert på standarden ISO 19135 Data Product Specification
status: SOSI godkjent

FKB-LedningLaser
type: Concept
in scheme: Produktspesifikasjoner
top concept of: Produktspesifikasjoner
definition: Dokumentet gir en detaljert beskrivelse av datasettet "FKB-LedningLaser" og er basert på standarden ISO 19131 Data Product Specification
description: Dokumentet gir en detaljert beskrivelse av datasettet "FKB-LedningLaser" og er basert på standarden ISO 19131 Data Product Specification
status: Tilbaketrukket

Fremmedartlista
type: Concept
in scheme: Produktspesifikasjoner
top concept of: Produktspesifikasjoner
status: Gyldig

Markagrensen
type: Concept
in scheme: Produktspesifikasjoner
top concept of: Produktspesifikasjoner
definition: Dokumentet gir en detaljert beskrivelse av datasettet "Markagrensen" og er basert på standarden ISO 19131 Data Product Specification
description: Dokumentet gir en detaljert beskrivelse av datasettet "Markagrensen" og er basert på standarden ISO 19131 Data Product Specification
status: SOSI godkjent

Administrative enheter - Norges maritime grenser
type: Concept
in scheme: Produktspesifikasjoner
top concept of: Produktspesifikasjoner
definition: Dokumentet gir en detaljert beskrivelse av datasettet "Norges maritime grenser" og er basert på standarden ISO 19131 Data Product Specification
description: Dokumentet gir en detaljert beskrivelse av datasettet "Norges maritime grenser" og er basert på standarden ISO 19131 Data Product Specification
status: Gyldig

Villreinområder
type: Concept
in scheme: Produktspesifikasjoner
top concept of: Produktspesifikasjoner
definition: Dokumentet gir en detaljert beskrivelse av datasettet "Villreinområder" og er basert på standarden ISO 19135 Data Product Specification. Datasettet viser leveområder og funksjonsområder for villrein, som det bør tas spesielt hensyn til i arealplanlegging mv.
description: Dokumentet gir en detaljert beskrivelse av datasettet "Villreinområder" og er basert på standarden ISO 19135 Data Product Specification. Datasettet viser leveområder og funksjonsområder for villrein, som det bør tas spesielt hensyn til i arealplanlegging mv.
status: SOSI godkjent

Arter av nasjonal forvaltningsinteresse
type: Concept
in scheme: Produktspesifikasjoner
top concept of: Produktspesifikasjoner
definition: Dokumentet gir en detaljert beskrivelse av datasettet Arter av nasjonal forvaltningsinteresse
description: Dokumentet gir en detaljert beskrivelse av datasettet Arter av nasjonal forvaltningsinteresse
status: SOSI godkjent

Tettsted
type: Concept
in scheme: Produktspesifikasjoner
top concept of: Produktspesifikasjoner
definition: Dokumentet gir en detaljert beskrivelse av datasettet "Tettsteder" og er basert på standarden ISO 19131 Data Product Specification
description: Dokumentet gir en detaljert beskrivelse av datasettet "Tettsteder" og er basert på standarden ISO 19131 Data Product Specification
status: SOSI godkjent

Støy med veiledningsmateriale
type: Concept
in scheme: Produktspesifikasjoner
top concept of: Produktspesifikasjoner
definition: Dokumentet gir en detaljert beskrivelse av datasettet "Støy med veiledningsmateriale" og er basert på standarden ISO 19135 Data Product Specification
description: Dokumentet gir en detaljert beskrivelse av datasettet "Støy med veiledningsmateriale" og er basert på standarden ISO 19135 Data Product Specification
status: Gyldig

Skredhendelser
type: Concept
in scheme: Produktspesifikasjoner
top concept of: Produktspesifikasjoner
definition: Dokumentet gir en detaljert beskrivelse av datasettet "Skredhendelser" og er basert på standarden ISO 19131 Data Product Specification. Formålet med datasettet er å samle tilgjengelig informasjon om skred som har gått, fra offentlige etater, konsulentselskap og privatpersoner.
description: Dokumentet gir en detaljert beskrivelse av datasettet "Skredhendelser" og er basert på standarden ISO 19131 Data Product Specification. Formålet med datasettet er å samle tilgjengelig informasjon om skred som har gått, fra offentlige etater, konsulentselskap og privatpersoner.
status: SOSI godkjent

Bunnfellingsområder
type: Concept
in scheme: Produktspesifikasjoner
top concept of: Produktspesifikasjoner
definition: Dokumentet gir en detaljert beskrivelse av datasettet og er basert på standarden ISO 19131 Data Product Specification.
description: Dokumentet gir en detaljert beskrivelse av datasettet og er basert på standarden ISO 19131 Data Product Specification.
status: SOSI godkjent

Reindrift - Restriksjonsområde
type: Concept
in scheme: Produktspesifikasjoner
top concept of: Produktspesifikasjoner
definition: Dokumentet gir en detaljert beskrivelse av datasettet "Reindrift - Restriksjonsområde" og er basert på standarden ISO 19135 Data Product Specification.
description: Dokumentet gir en detaljert beskrivelse av datasettet "Reindrift - Restriksjonsområde" og er basert på standarden ISO 19135 Data Product Specification.
status: SOSI godkjent

Vegkropp prosjektert
type: Concept
in scheme: Produktspesifikasjoner
top concept of: Produktspesifikasjoner
status: SOSI godkjent

Foreslåtte naturvernområder
type: Concept
in scheme: Produktspesifikasjoner
top concept of: Produktspesifikasjoner
definition: Dokumentet gir en detaljert beskrivelse av datasettet "Foreslåtte naturvernområder" og er basert på standarden ISO 19131 Data Product Specification. Datasettet viser områder som er under planlegging og sendt på offentlig høring etter lov om Naturmangfold - Kapittel V.
description: Dokumentet gir en detaljert beskrivelse av datasettet "Foreslåtte naturvernområder" og er basert på standarden ISO 19131 Data Product Specification. Datasettet viser områder som er under planlegging og sendt på offentlig høring etter lov om Naturmangfold - Kapittel V.
status: SOSI godkjent

Flom aktsomhetsområder
type: Concept
in scheme: Produktspesifikasjoner
top concept of: Produktspesifikasjoner
definition: Dokumentet gir en detaljert beskrivelse av datasettet og er basert på standarden ISO 19131 Data Product Specification.
description: Dokumentet gir en detaljert beskrivelse av datasettet og er basert på standarden ISO 19131 Data Product Specification.
status: SOSI godkjent

Vannkraft
type: Concept
in scheme: Produktspesifikasjoner
top concept of: Produktspesifikasjoner
definition: Dokumentet er basert på standarden ISO 19131 Data Product Specification, og gir en detaljert beskrivelse for det nasjonale vannkraftsystem; utbygde og planlagte kraftverk, vannveier, dammmer, regulerte innsjøer og delfelt.
description: Dokumentet er basert på standarden ISO 19131 Data Product Specification, og gir en detaljert beskrivelse for det nasjonale vannkraftsystem; utbygde og planlagte kraftverk, vannveier, dammmer, regulerte innsjøer og delfelt.
status: SOSI godkjent

Mareano bunnprøver punkt
type: Concept
in scheme: Produktspesifikasjoner
top concept of: Produktspesifikasjoner
definition: Dokumentet gir en detaljert beskrivelse av datasettet og er basert på standarden ISO 19131 Data Product Specification.
description: Dokumentet gir en detaljert beskrivelse av datasettet og er basert på standarden ISO 19131 Data Product Specification.
status: SOSI godkjent

Innmålingsinnstruks VA, drivstoff, gass og fjernvarme
type: Concept
in scheme: Produktspesifikasjoner
top concept of: Produktspesifikasjoner
definition: Dokumentet gir en detaljert beskrivelse av «Innmålingsinnstruks VA, drivstoff, gass og fjernvarme» og er basert på standarden ISO 19131 Data Product Specification
description: Dokumentet gir en detaljert beskrivelse av «Innmålingsinnstruks VA, drivstoff, gass og fjernvarme» og er basert på standarden ISO 19131 Data Product Specification
status: Utkast

Avvik Kartdata
type: Concept
in scheme: Produktspesifikasjoner
top concept of: Produktspesifikasjoner
definition: Produktspesifikasjon som spesifiserer hvordan avvik på kartdata skal utveksles
description: Produktspesifikasjon som spesifiserer hvordan avvik på kartdata skal utveksles
status: Gyldig

Organiske miljøgifter i marine sedimenter
type: Concept
in scheme: Produktspesifikasjoner
top concept of: Produktspesifikasjoner
definition: Dokumentet gir en detaljert beskrivelse av datasettet og er basert på standarden ISO 19131 Data Product Specification.
description: Dokumentet gir en detaljert beskrivelse av datasettet og er basert på standarden ISO 19131 Data Product Specification.
status: SOSI godkjent

S100 Kartdata
type: Concept
in scheme: Produktspesifikasjoner
top concept of: Produktspesifikasjoner
definition: Dokumentet gir en detaljert beskrivelse av datasettet "S100 Kartdata" og er basert på standarden ISO 19135 Data Product Specification
description: Dokumentet gir en detaljert beskrivelse av datasettet "S100 Kartdata" og er basert på standarden ISO 19135 Data Product Specification
status: Utkast

Tilgjengelighet - tettsted
type: Concept
in scheme: Produktspesifikasjoner
top concept of: Produktspesifikasjoner
definition: Dokumentet gir en detaljert beskrivelse av datasettet "Tilgjengelighet - tettsted" og er basert på standarden ISO 19131 Data Product Specification
description: Dokumentet gir en detaljert beskrivelse av datasettet "Tilgjengelighet - tettsted" og er basert på standarden ISO 19131 Data Product Specification
status: Tilbaketrukket

Kulturminner - SEFRAK
type: Concept
in scheme: Produktspesifikasjoner
top concept of: Produktspesifikasjoner
definition: Produktspesifikasjonen beskriver datasettet SEFRAK for det offentlige kartgrunnlaget
description: Produktspesifikasjonen beskriver datasettet SEFRAK for det offentlige kartgrunnlaget
status: SOSI godkjent

Naturtyper i Norge - Landskap
type: Concept
in scheme: Produktspesifikasjoner
top concept of: Produktspesifikasjoner
definition: Dokumentet gir en detaljert beskrivelse av datasettet og er basert på standarden ISO 19131 Data Product Specification.
description: Dokumentet gir en detaljert beskrivelse av datasettet og er basert på standarden ISO 19131 Data Product Specification.
status: SOSI godkjent

DOK fullstendighetdekningskart
type: Concept
in scheme: Produktspesifikasjoner
top concept of: Produktspesifikasjoner
status: Sendt inn

FKB Vegnett
type: Concept
in scheme: Produktspesifikasjoner
top concept of: Produktspesifikasjoner
definition: Dokumentet gir en detaljert beskrivelse av datasettet "FKB – Vegnett" og er basert på standarden ISO 19131 Data Product Specification
description: Dokumentet gir en detaljert beskrivelse av datasettet "FKB – Vegnett" og er basert på standarden ISO 19131 Data Product Specification
status: Tilbaketrukket

Mineralressurser; industrimineral, naturstein og metaller
type: Concept
in scheme: Produktspesifikasjoner
top concept of: Produktspesifikasjoner
definition: Dokumentet gir en detaljert beskrivelse av datasettet og er basert på standarden ISO 19131 Data Product Specification.
description: Dokumentet gir en detaljert beskrivelse av datasettet og er basert på standarden ISO 19131 Data Product Specification.
status: SOSI godkjent

Stedfestingsdata for påviste eller avdekkede ledninger
type: Concept
in scheme: Produktspesifikasjoner
top concept of: Produktspesifikasjoner
definition: Dokumentet gir en detaljert beskrivelse av datasettet "Stedfestingsdata for påviste eller avdekkede ledninger" og er basert på standarden ISO 19131 Data Product Specification
description: Dokumentet gir en detaljert beskrivelse av datasettet "Stedfestingsdata for påviste eller avdekkede ledninger" og er basert på standarden ISO 19131 Data Product Specification
status: Gyldig

Sårbare marine bunndyr - observasjonsdata
type: Concept
in scheme: Produktspesifikasjoner
top concept of: Produktspesifikasjoner
definition: Dokumentet gir en detaljert beskrivelse av datasettet og er basert på standarden ISO 19131 Data Product Specification.
description: Dokumentet gir en detaljert beskrivelse av datasettet og er basert på standarden ISO 19131 Data Product Specification.
status: SOSI godkjent

Reindrift - Reinbeitedistrikt
type: Concept
in scheme: Produktspesifikasjoner
top concept of: Produktspesifikasjoner
definition: Dokumentet gir en detaljert beskrivelse av datasettet "Reindrift - Reinbeitedistrikt" og er basert på standarden ISO 19135 Data Product Specification.
description: Dokumentet gir en detaljert beskrivelse av datasettet "Reindrift - Reinbeitedistrikt" og er basert på standarden ISO 19135 Data Product Specification.
status: SOSI godkjent

N20 Kartdata
type: Concept
in scheme: Produktspesifikasjoner
top concept of: Produktspesifikasjoner
definition: Dokumentet gir en detaljert beskrivelse av datasettet "N20 Kartdata" og er basert på standarden ISO 19135 Data Product Specification
description: Dokumentet gir en detaljert beskrivelse av datasettet "N20 Kartdata" og er basert på standarden ISO 19135 Data Product Specification
status: Gyldig

N5000 Kartdata
type: Concept
in scheme: Produktspesifikasjoner
top concept of: Produktspesifikasjoner
definition: Dokumentet gir en detaljert beskrivelse av datasettet "N5000 Kartdata" og er basert på standarden ISO 19135 Data Product Specification
description: Dokumentet gir en detaljert beskrivelse av datasettet "N5000 Kartdata" og er basert på standarden ISO 19135 Data Product Specification
status: SOSI godkjent

Mineralressurser
type: Concept
in scheme: Produktspesifikasjoner
top concept of: Produktspesifikasjoner
definition: Dokumentet gir en detaljert beskrivelse av datasettet "Mineralressurser" og er basert på standarden ISO 19135 Data Product Specification
description: Dokumentet gir en detaljert beskrivelse av datasettet "Mineralressurser" og er basert på standarden ISO 19135 Data Product Specification
status: SOSI godkjent

Samkopiering av laserdata
type: Concept
in scheme: Produktspesifikasjoner
top concept of: Produktspesifikasjoner
definition: Dokumentet gir en detaljert beskrivelse av datasettet "Samkopiering av laserdata" og er basert på standarden ISO 19135 Data Product Specification
description: Dokumentet gir en detaljert beskrivelse av datasettet "Samkopiering av laserdata" og er basert på standarden ISO 19135 Data Product Specification
status: Utkast

Reindrift - Beitehage
type: Concept
in scheme: Produktspesifikasjoner
top concept of: Produktspesifikasjoner
definition: Dokumentet gir en detaljert beskrivelse av datasettet "Reindrift - Beitehage" og er basert på standarden ISO 19135 Data Product Specification.
description: Dokumentet gir en detaljert beskrivelse av datasettet "Reindrift - Beitehage" og er basert på standarden ISO 19135 Data Product Specification.
status: SOSI godkjent

FKB Lufthavn
type: Concept
in scheme: Produktspesifikasjoner
top concept of: Produktspesifikasjoner
definition: Dokumentet gir en detaljert beskrivelse av datasettet "FKB Lufthavn" og er basert på standarden ISO 19131 Data Product Specification
description: Dokumentet gir en detaljert beskrivelse av datasettet "FKB Lufthavn" og er basert på standarden ISO 19131 Data Product Specification
status: SOSI godkjent

FKB Arealbruk
type: Concept
in scheme: Produktspesifikasjoner
top concept of: Produktspesifikasjoner
definition: Dokumentet gir en detaljert beskrivelse av datasettet "FKB Arealbruk" og er basert på standarden ISO 19131 Data Product Specification
description: Dokumentet gir en detaljert beskrivelse av datasettet "FKB Arealbruk" og er basert på standarden ISO 19131 Data Product Specification
status: SOSI godkjent

AR50
type: Concept
in scheme: Produktspesifikasjoner
top concept of: Produktspesifikasjoner
definition: Dokumentet gir en detaljert beskrivelse av datasettet "AR50" og er basert på standarden ISO 19135 Data Product Specification.
description: Dokumentet gir en detaljert beskrivelse av datasettet "AR50" og er basert på standarden ISO 19135 Data Product Specification.
status: SOSI godkjent

Mareano kjemistasjoner
type: Concept
in scheme: Produktspesifikasjoner
top concept of: Produktspesifikasjoner
definition: Dokumentet gir en detaljert beskrivelse av datasettet og er basert på standarden ISO 19131 Data Product Specification.
description: Dokumentet gir en detaljert beskrivelse av datasettet og er basert på standarden ISO 19131 Data Product Specification.
status: SOSI godkjent

Del 3.2 - Reguleringsplaner
type: Concept
in scheme: Produktspesifikasjoner
top concept of: Produktspesifikasjoner
definition: Denne produktspesifikasjonen, del 3.2 gjelder vedtatte reguleringsplaner (planstatus 3-8) og utveksling av data fra forvaltningsbaser og planregister.
description: Denne produktspesifikasjonen, del 3.2 gjelder vedtatte reguleringsplaner (planstatus 3-8) og utveksling av data fra forvaltningsbaser og planregister.
status: Gyldig

Kvikkleire
type: Concept
in scheme: Produktspesifikasjoner
top concept of: Produktspesifikasjoner
definition: Dokumentet gir en detaljert beskrivelse av datasettet "Kvikkleire" og er basert på standarden ISO 19131 Data Product Specification. Kartlagte kvikkleiresoner gir en oversikt over soner med potensiell fare (aktsomhetsområder) for større kvikkleireskred, og videre risikoen tilknyttet disse områdene.
description: Dokumentet gir en detaljert beskrivelse av datasettet "Kvikkleire" og er basert på standarden ISO 19131 Data Product Specification. Kartlagte kvikkleiresoner gir en oversikt over soner med potensiell fare (aktsomhetsområder) for større kvikkleireskred, og videre risikoen tilknyttet disse områdene.
status: SOSI godkjent

Stormflo og havnivå
type: Concept
in scheme: Produktspesifikasjoner
top concept of: Produktspesifikasjoner
definition: Dokumentet gir en detaljert beskrivelse av datasettet "Stormflo og havnivå" og er basert på standarden ISO 19131 Data Product Specification
description: Dokumentet gir en detaljert beskrivelse av datasettet "Stormflo og havnivå" og er basert på standarden ISO 19131 Data Product Specification
status: SOSI godkjent

Forsvarets skyte- og øvingsfelt i sjø
type: Concept
in scheme: Produktspesifikasjoner
top concept of: Produktspesifikasjoner
definition: Spesifikasjonen beskriver datasettet Forsvarets skyte- og øvingsfelt i sjø (SØF i sjø) viser Forsvarets øvingsområder til sjøs
description: Spesifikasjonen beskriver datasettet Forsvarets skyte- og øvingsfelt i sjø (SØF i sjø) viser Forsvarets øvingsområder til sjøs
status: Utkast

Statistiske enheter - Norges grunnkretser
type: Concept
in scheme: Produktspesifikasjoner
top concept of: Produktspesifikasjoner
definition: Dokumentet gir en detaljert beskrivelse av datasettet "Statistiske enheter - Norges grunnkretser" og er basert på standarden ISO 19135 Data Product Specification
description: Dokumentet gir en detaljert beskrivelse av datasettet "Statistiske enheter - Norges grunnkretser" og er basert på standarden ISO 19135 Data Product Specification
status: Gyldig

Korallrev
type: Concept
in scheme: Produktspesifikasjoner
top concept of: Produktspesifikasjoner
definition: Dokumentet gir en detaljert beskrivelse av datasettet "Korallrev" og er basert på standarden ISO 19131 Data Product Specification
description: Dokumentet gir en detaljert beskrivelse av datasettet "Korallrev" og er basert på standarden ISO 19131 Data Product Specification
status: SOSI godkjent

N2000 Kartdata
type: Concept
in scheme: Produktspesifikasjoner
top concept of: Produktspesifikasjoner
definition: Dokumentet gir en detaljert beskrivelse av datasettet «N2000 Kartdata» og er basert på standarden ISO 19135 Data
description: Dokumentet gir en detaljert beskrivelse av datasettet «N2000 Kartdata» og er basert på standarden ISO 19135 Data
status: SOSI godkjent

Marine landskap
type: Concept
in scheme: Produktspesifikasjoner
top concept of: Produktspesifikasjoner
definition: Dokumentet gir en detaljert beskrivelse av datasettet "Marine landskap" og er basert på standarden ISO 19135 Data Product Specification
description: Dokumentet gir en detaljert beskrivelse av datasettet "Marine landskap" og er basert på standarden ISO 19135 Data Product Specification
status: SOSI godkjent

Aktsomhetskart for jord- og flomskred
type: Concept
in scheme: Produktspesifikasjoner
top concept of: Produktspesifikasjoner
definition: Dokumentet gir en detaljert beskrivelse av datasettet "Aktsomhetskart for jord- og flomskred" og er basert på standarden ISO 19131 Data Product Specification
description: Dokumentet gir en detaljert beskrivelse av datasettet "Aktsomhetskart for jord- og flomskred" og er basert på standarden ISO 19131 Data Product Specification
status: SOSI godkjent

Grunn gass
type: Concept
in scheme: Produktspesifikasjoner
top concept of: Produktspesifikasjoner
definition: Dokumentet gir en detaljert beskrivelse av datasettet "Grunn gass" og er basert på standarden ISO 19131 Data Product Specification
description: Dokumentet gir en detaljert beskrivelse av datasettet "Grunn gass" og er basert på standarden ISO 19131 Data Product Specification
status: SOSI godkjent

N5 Presentasjonsdata
type: Concept
in scheme: Produktspesifikasjoner
top concept of: Produktspesifikasjoner
status: SOSI godkjent

Matrikkelen - Vegadresse
type: Concept
in scheme: Produktspesifikasjoner
top concept of: Produktspesifikasjoner
definition: Dokumentet gir en detaljert beskrivelse av datasettet "Matrikkelen - Vegadresse" og er basert på standarden ISO 19135 Data Product Specification
description: Dokumentet gir en detaljert beskrivelse av datasettet "Matrikkelen - Vegadresse" og er basert på standarden ISO 19135 Data Product Specification
status: SOSI godkjent

Administrative enheter Norge
type: Concept
in scheme: Produktspesifikasjoner
top concept of: Produktspesifikasjoner
definition: Dokumentet gir en detaljert beskrivelse av datasettet "Administrative enheter Norge" og er basert på standarden ISO 19131 Data Product Specification
description: Dokumentet gir en detaljert beskrivelse av datasettet "Administrative enheter Norge" og er basert på standarden ISO 19131 Data Product Specification
status: SOSI godkjent

Laserdata til Skogbruksformål (Laser-Skog)
type: Concept
in scheme: Produktspesifikasjoner
top concept of: Produktspesifikasjoner
definition: Dokumentet gir en detaljert beskrivelse av datasettet "Laserdata til Skogbruksformål (Laser-Skog)" og er basert på standarden ISO 19135 Data Product Specification
description: Dokumentet gir en detaljert beskrivelse av datasettet "Laserdata til Skogbruksformål (Laser-Skog)" og er basert på standarden ISO 19135 Data Product Specification
status: Utkast

FKB Veg
type: Concept
in scheme: Produktspesifikasjoner
top concept of: Produktspesifikasjoner
definition: Dokumentet gir en detaljert beskrivelse av datasettet "FKB Veg" og er basert på standarden ISO 19131 Data Product Specification
description: Dokumentet gir en detaljert beskrivelse av datasettet "FKB Veg" og er basert på standarden ISO 19131 Data Product Specification
status: SOSI godkjent

Barnetråkk - fullstendig
type: Concept
in scheme: Produktspesifikasjoner
top concept of: Produktspesifikasjoner
definition: Dokumentet gir en detaljert beskrivelse av datasettet og er basert på standarden ISO 19131 Data Product Specification.
description: Dokumentet gir en detaljert beskrivelse av datasettet og er basert på standarden ISO 19131 Data Product Specification.
status: SOSI godkjent

Tilgjengelighet - friluft
type: Concept
in scheme: Produktspesifikasjoner
top concept of: Produktspesifikasjoner
definition: Dokumentet gir en detaljert beskrivelse av datasettet "Tilgjengelighet - friluft" og er basert på standarden ISO 19131 Data Product Specification
description: Dokumentet gir en detaljert beskrivelse av datasettet "Tilgjengelighet - friluft" og er basert på standarden ISO 19131 Data Product Specification
status: Tilbaketrukket

Reindrift - Ekspropriasjonsområde
type: Concept
in scheme: Produktspesifikasjoner
top concept of: Produktspesifikasjoner
definition: Dokumentet gir en detaljert beskrivelse av datasettet "Reindrift - Ekspropriasjonsområde" og er basert på standarden ISO 19135 Data Product Specification.
description: Dokumentet gir en detaljert beskrivelse av datasettet "Reindrift - Ekspropriasjonsområde" og er basert på standarden ISO 19135 Data Product Specification.
status: SOSI godkjent

FKB Bane
type: Concept
in scheme: Produktspesifikasjoner
top concept of: Produktspesifikasjoner
definition: Dokumentet gir en detaljert beskrivelse av datasettet "FKB Bane" og er basert på standarden ISO 19131 Data Product Specification
description: Dokumentet gir en detaljert beskrivelse av datasettet "FKB Bane" og er basert på standarden ISO 19131 Data Product Specification
status: SOSI godkjent

Naturvernområder
type: Concept
in scheme: Produktspesifikasjoner
top concept of: Produktspesifikasjoner
definition: Dokumentet gir en detaljert beskrivelse av datasettet "Naturvernområder" og er basert på standarden ISO 19135 Data Product Specification
description: Dokumentet gir en detaljert beskrivelse av datasettet "Naturvernområder" og er basert på standarden ISO 19135 Data Product Specification
status: SOSI godkjent

Stemmekretser
type: Concept
in scheme: Produktspesifikasjoner
top concept of: Produktspesifikasjoner
definition: Dokumentet gir en detaljert beskrivelse av datasettet "Stemmekretser" og er basert på standarden ISO 19131 Data Product Specification
description: Dokumentet gir en detaljert beskrivelse av datasettet "Stemmekretser" og er basert på standarden ISO 19131 Data Product Specification
status: Gyldig

Elveg 2.0
type: Concept
in scheme: Produktspesifikasjoner
top concept of: Produktspesifikasjoner
definition: Dokumentet gir en detaljert beskrivelse av datasettet «Elveg 2.0», og er basert på standarden ISO 19131 Data Product Specification
description: Dokumentet gir en detaljert beskrivelse av datasettet «Elveg 2.0», og er basert på standarden ISO 19131 Data Product Specification
status: SOSI godkjent

Løsmasser N50 N250
type: Concept
in scheme: Produktspesifikasjoner
top concept of: Produktspesifikasjoner
definition: Dokumentet gir en detaljert beskrivelse av datasettet "Løsmasser N50/N250" og er basert på standarden ISO 19131 Data Product Specification
description: Dokumentet gir en detaljert beskrivelse av datasettet "Løsmasser N50/N250" og er basert på standarden ISO 19131 Data Product Specification
status: SOSI godkjent

Anlegg med farlig stoff
type: Concept
in scheme: Produktspesifikasjoner
top concept of: Produktspesifikasjoner
definition: Dokumentet gir en detaljert beskrivelse av datasettet "Anlegg med farlig stoff" og er basert på standarden ISO 19131 Data Product Specification.
description: Dokumentet gir en detaljert beskrivelse av datasettet "Anlegg med farlig stoff" og er basert på standarden ISO 19131 Data Product Specification.
status: SOSI godkjent

Digitale ortofoto
type: Concept
in scheme: Produktspesifikasjoner
top concept of: Produktspesifikasjoner
definition: Dokumentet gir en detaljert beskrivelse av datasettet "Digitale ortofoto" og er basert på standarden ISO 19131 Data Product Specification.
description: Dokumentet gir en detaljert beskrivelse av datasettet "Digitale ortofoto" og er basert på standarden ISO 19131 Data Product Specification.
status: SOSI godkjent

FKB Ledning Ekom (forvaltning)
type: Concept
in scheme: Produktspesifikasjoner
top concept of: Produktspesifikasjoner
definition: Dokumentet gir en detaljert beskrivelse av datasettet "FKB Ledning Ekom" og er basert på standarden ISO 19131 Data Product Specification
description: Dokumentet gir en detaljert beskrivelse av datasettet "FKB Ledning Ekom" og er basert på standarden ISO 19131 Data Product Specification
status: Tilbaketrukket

SR16 - Skogressurskart
type: Concept
in scheme: Produktspesifikasjoner
top concept of: Produktspesifikasjoner
definition: Dokumentet gir en detaljert beskrivelse av datasettet "SR16 - Skogressurskart" og er basert på standarden ISO 19131 Data Product Specification
description: Dokumentet gir en detaljert beskrivelse av datasettet "SR16 - Skogressurskart" og er basert på standarden ISO 19131 Data Product Specification
status: SOSI godkjent

Gassoppkommer
type: Concept
in scheme: Produktspesifikasjoner
top concept of: Produktspesifikasjoner
definition: Dokumentet gir en detaljert beskrivelse av datasettet Gassoppkommer og er basert på standarden ISO 19131 Data Product Specification.
description: Dokumentet gir en detaljert beskrivelse av datasettet Gassoppkommer og er basert på standarden ISO 19131 Data Product Specification.
status: SOSI godkjent

Akkumulasjonsrater for organisk karbon i havbunnsedimenter i Nordsjøen og Skagerrak
type: Concept
in scheme: Produktspesifikasjoner
top concept of: Produktspesifikasjoner
definition: Dokumentet gir en detaljert beskrivelse av datasettet "Akkumulasjonsrater for organisk karbon i havbunnsedimenter i Nordsjøen og Skagerrak" og tilhørende datasett "Usikkerheten i estimerte akkumulasjonsrater for organisk karbon"
description: Dokumentet gir en detaljert beskrivelse av datasettet "Akkumulasjonsrater for organisk karbon i havbunnsedimenter i Nordsjøen og Skagerrak" og tilhørende datasett "Usikkerheten i estimerte akkumulasjonsrater for organisk karbon"
status: SOSI godkjent

Farled
type: Concept
in scheme: Produktspesifikasjoner
top concept of: Produktspesifikasjoner
definition: Viser farleden langs kysten og områder hvor Kystverket har sine hovedinteresseområder i tilknytning til denne.
description: Viser farleden langs kysten og områder hvor Kystverket har sine hovedinteresseområder i tilknytning til denne.
status: SOSI godkjent

N500 Kartdata
type: Concept
in scheme: Produktspesifikasjoner
top concept of: Produktspesifikasjoner
definition: Dokumentet gir en detaljert beskrivelse av datasettet «N500 Kartdata» og er basert på standarden ISO 19135 Data
description: Dokumentet gir en detaljert beskrivelse av datasettet «N500 Kartdata» og er basert på standarden ISO 19135 Data
status: SOSI godkjent

Skjellsandområder
type: Concept
in scheme: Produktspesifikasjoner
top concept of: Produktspesifikasjoner
status: SOSI godkjent

Radon aktsomhet
type: Concept
in scheme: Produktspesifikasjoner
top concept of: Produktspesifikasjoner
definition: Dokumentet gir en detaljert beskrivelse av datasettet "Radon aktsomhet" og er basert på standarden ISO 19131 Data Product Specification. Datasettet viser hvilke områder i Norge som trolig er mer radonutsatt enn andre.
description: Dokumentet gir en detaljert beskrivelse av datasettet "Radon aktsomhet" og er basert på standarden ISO 19131 Data Product Specification. Datasettet viser hvilke områder i Norge som trolig er mer radonutsatt enn andre.
status: SOSI godkjent

Del 3.1 - Kommuneplanens arealdel
type: Concept
in scheme: Produktspesifikasjoner
top concept of: Produktspesifikasjoner
definition: Produktspesifikasjon som viser hvordan man skal produsere kommuneplanens arealdel i samsvar med pbl. kap. 11.
description: Produktspesifikasjon som viser hvordan man skal produsere kommuneplanens arealdel i samsvar med pbl. kap. 11.
status: Gyldig

Ankringsområder
type: Concept
in scheme: Produktspesifikasjoner
top concept of: Produktspesifikasjoner
definition: Dokumentet gir en detaljert beskrivelse av datasettet "Ankringsområder" og er basert på standarden ISO 19131 Data Product Specification
description: Dokumentet gir en detaljert beskrivelse av datasettet "Ankringsområder" og er basert på standarden ISO 19131 Data Product Specification
status: SOSI godkjent

Tungmetaller og andre uorganiske miljøelementer i marine sedimenter v2
type: Concept
in scheme: Produktspesifikasjoner
top concept of: Produktspesifikasjoner
definition: Dokumentet gir en detaljert beskrivelse av datasettet "Tungmetaller og andre uorganiske miljøelementer i marine sedimenter.
description: Dokumentet gir en detaljert beskrivelse av datasettet "Tungmetaller og andre uorganiske miljøelementer i marine sedimenter.
status: Utkast

NVDB Rutedatasett
type: Concept
in scheme: Produktspesifikasjoner
top concept of: Produktspesifikasjoner
definition: NVDB-Rutedatasett er et produkt fra NVDB som er beregnet på navigasjon og ruteplanlegging. Datasettet har et vegnett segmentert på aktuelle strekningsegenskaper fra NVDB. Vegsperringer, svingerestriksjoner og gjennomkjøring Forbudt leveres som egne objekter. Produktet leveres fylkesvis på filformatet SpatiaLite. NB! Her finner du nå utkastet til versjon 2 av datasettet. Data iht. denne versjonen vil etter planen legges ut fra november-leveransen. Les denne nyhetssaken på nvdb.no: Ny versjon av NVDB Rutedatasett klar for testing for informasjon om endringer, testfiler og ev. tilbakemeldinger.
description: NVDB-Rutedatasett er et produkt fra NVDB som er beregnet på navigasjon og ruteplanlegging. Datasettet har et vegnett segmentert på aktuelle strekningsegenskaper fra NVDB. Vegsperringer, svingerestriksjoner og gjennomkjøring Forbudt leveres som egne objekter. Produktet leveres fylkesvis på filformatet SpatiaLite. NB! Her finner du nå utkastet til versjon 2 av datasettet. Data iht. denne versjonen vil etter planen legges ut fra november-leveransen. Les denne nyhetssaken på nvdb.no: Ny versjon av NVDB Rutedatasett klar for testing for informasjon om endringer, testfiler og ev. tilbakemeldinger.
status: Gyldig

Barmarksløyper i Finnmark
type: Concept
in scheme: Produktspesifikasjoner
top concept of: Produktspesifikasjoner
definition: Dokumentet gir en detaljert beskrivelse av datasettet og er basert på standarden ISO 19131 Data Product Specification.
description: Dokumentet gir en detaljert beskrivelse av datasettet og er basert på standarden ISO 19131 Data Product Specification.
status: Utkast

N20 Bygning
type: Concept
in scheme: Produktspesifikasjoner
top concept of: Produktspesifikasjoner
definition: Dokumentet gir en detaljert beskrivelse av datasettet "N20 Bygg" og er basert på standarden ISO 19135 Data Product Specification
description: Dokumentet gir en detaljert beskrivelse av datasettet "N20 Bygg" og er basert på standarden ISO 19135 Data Product Specification
status: Gyldig

Marine biotoper
type: Concept
in scheme: Produktspesifikasjoner
top concept of: Produktspesifikasjoner
definition: Dokumentet gir en detaljert beskrivelse av datasettet "Marine biotoper".
description: Dokumentet gir en detaljert beskrivelse av datasettet "Marine biotoper".
status: Utkast