Organisasjoner
type: ConceptScheme
description: Inneholder oversikt over organisasjoner og deres logo

Utsira kommune
type: Concept
in scheme: Organisasjoner
top concept of: Organisasjoner
status: Gyldig

Porsgrunn kommune
type: Concept
in scheme: Organisasjoner
top concept of: Organisasjoner
status: Gyldig

Hurdal kommune
type: Concept
in scheme: Organisasjoner
top concept of: Organisasjoner
status: Gyldig

Skaun kommune
type: Concept
in scheme: Organisasjoner
top concept of: Organisasjoner
status: Gyldig

Kartverket
type: Concept
in scheme: Organisasjoner
top concept of: Organisasjoner
definition: Kartverket har ansvar for den geografiske infrastrukturen og offentleg eigedomsinformasjon, og er tinglysingsmakt for heile landet.
description: Kartverket har ansvar for den geografiske infrastrukturen og offentleg eigedomsinformasjon, og er tinglysingsmakt for heile landet.
status: Gyldig

Melhus kommune
type: Concept
in scheme: Organisasjoner
top concept of: Organisasjoner
status: Gyldig

Trondheim kommune
type: Concept
in scheme: Organisasjoner
top concept of: Organisasjoner
status: Gyldig

Oslo kommune
type: Concept
in scheme: Organisasjoner
top concept of: Organisasjoner
status: Gyldig

Universitetet i Bergen
type: Concept
in scheme: Organisasjoner
top concept of: Organisasjoner
status: Gyldig

Opplysningsvesenets fond
type: Concept
in scheme: Organisasjoner
top concept of: Organisasjoner
status: Gyldig

Ulvik kommune
type: Concept
in scheme: Organisasjoner
top concept of: Organisasjoner
status: Gyldig

Surnadal kommune
type: Concept
in scheme: Organisasjoner
top concept of: Organisasjoner
status: Gyldig

Lier kommune
type: Concept
in scheme: Organisasjoner
top concept of: Organisasjoner
status: Gyldig

Meløy kommune
type: Concept
in scheme: Organisasjoner
top concept of: Organisasjoner
status: Gyldig

Øystre Slidre kommune
type: Concept
in scheme: Organisasjoner
top concept of: Organisasjoner
status: Gyldig

Narvik kommune
type: Concept
in scheme: Organisasjoner
top concept of: Organisasjoner
status: Gyldig

Østre toten kommune
type: Concept
in scheme: Organisasjoner
top concept of: Organisasjoner
status: Gyldig

Røyrvik kommune
type: Concept
in scheme: Organisasjoner
top concept of: Organisasjoner
status: Gyldig

Osterøy kommune
type: Concept
in scheme: Organisasjoner
top concept of: Organisasjoner
status: Gyldig

Heim kommune
type: Concept
in scheme: Organisasjoner
top concept of: Organisasjoner
status: Gyldig

Klima- og miljødepartementet
type: Concept
in scheme: Organisasjoner
top concept of: Organisasjoner
definition: Klima- og miljødepartementet (KLD) ivaretar helheten i regjeringens klima- og miljøpolitikk.
description: Klima- og miljødepartementet (KLD) ivaretar helheten i regjeringens klima- og miljøpolitikk.
status: Gyldig

Fylkesmannen i Troms
type: Concept
in scheme: Organisasjoner
top concept of: Organisasjoner
status: Erstattet

Sametinget
type: Concept
in scheme: Organisasjoner
top concept of: Organisasjoner
definition: Sametinget skal styrke samenes politiske stilling og fremme samenes interesser i Norge
description: Sametinget skal styrke samenes politiske stilling og fremme samenes interesser i Norge
status: Gyldig

Drangedal kommune
type: Concept
in scheme: Organisasjoner
top concept of: Organisasjoner
status: Gyldig

Unjargga gielda / Nesseby kommune
type: Concept
in scheme: Organisasjoner
top concept of: Organisasjoner
status: Gyldig

Kristiansand kommune
type: Concept
in scheme: Organisasjoner
top concept of: Organisasjoner
status: Gyldig

Masfjorden kommune
type: Concept
in scheme: Organisasjoner
top concept of: Organisasjoner
status: Gyldig

Avinor
type: Concept
in scheme: Organisasjoner
top concept of: Organisasjoner
definition: Samfunnsoppdraget til Avinor er å sikre heile Noreg gode luftfartstenester. Dette ansvaret består i å eige, drive og utvikle eit landsomfattande nett av flyplassar for sivil sektor, og ei samla flysikringstjeneste for sivil og militær sektor.
description: Samfunnsoppdraget til Avinor er å sikre heile Noreg gode luftfartstenester. Dette ansvaret består i å eige, drive og utvikle eit landsomfattande nett av flyplassar for sivil sektor, og ei samla flysikringstjeneste for sivil og militær sektor.
status: Gyldig

Den Digitale Østregionen
type: Concept
in scheme: Organisasjoner
top concept of: Organisasjoner
definition: Den Digitale Østregionen er et samarbeid mellom kommunene Gjerstad, Risør, Tvedestrand, Vegårshei og Åmli.
description: Den Digitale Østregionen er et samarbeid mellom kommunene Gjerstad, Risør, Tvedestrand, Vegårshei og Åmli.
status: Gyldig

Søndre land kommune
type: Concept
in scheme: Organisasjoner
top concept of: Organisasjoner
status: Gyldig

Flatanger kommune
type: Concept
in scheme: Organisasjoner
top concept of: Organisasjoner
status: Gyldig

Senja kommune
type: Concept
in scheme: Organisasjoner
top concept of: Organisasjoner
status: Gyldig

Statsforvalteren i Nordland
type: Concept
in scheme: Organisasjoner
top concept of: Organisasjoner
status: Tilbaketrukket

Norges geologiske undersøkelse
type: Concept
in scheme: Organisasjoner
top concept of: Organisasjoner
definition: NGU er landets sentrale institusjon for kunnskap om berggrunn, mineralressurser, løsmasser og grunnvann i Norge.
description: NGU er landets sentrale institusjon for kunnskap om berggrunn, mineralressurser, løsmasser og grunnvann i Norge.
status: Gyldig

Nesodden kommune
type: Concept
in scheme: Organisasjoner
top concept of: Organisasjoner
status: Gyldig

Stranda kommune
type: Concept
in scheme: Organisasjoner
top concept of: Organisasjoner
status: Gyldig

Hjartdal kommune
type: Concept
in scheme: Organisasjoner
top concept of: Organisasjoner
status: Gyldig

Fjord kommune
type: Concept
in scheme: Organisasjoner
top concept of: Organisasjoner
status: Gyldig

Vestby kommune
type: Concept
in scheme: Organisasjoner
top concept of: Organisasjoner
status: Gyldig

Risør kommune
type: Concept
in scheme: Organisasjoner
top concept of: Organisasjoner
status: Gyldig

Kvam kommune
type: Concept
in scheme: Organisasjoner
top concept of: Organisasjoner
status: Gyldig

Farsund kommune
type: Concept
in scheme: Organisasjoner
top concept of: Organisasjoner
status: Gyldig

Statens vegvesen
type: Concept
in scheme: Organisasjoner
top concept of: Organisasjoner
definition: Statens vegvesen har sektoransvar for veg og vegtrafikk, herunder fremme sektorens bidrag til et bedre samfunn.
description: Statens vegvesen har sektoransvar for veg og vegtrafikk, herunder fremme sektorens bidrag til et bedre samfunn.
status: Gyldig

Flekkefjord kommune
type: Concept
in scheme: Organisasjoner
top concept of: Organisasjoner
status: Gyldig

Færder kommune
type: Concept
in scheme: Organisasjoner
top concept of: Organisasjoner
status: Gyldig

Sirdal kommune
type: Concept
in scheme: Organisasjoner
top concept of: Organisasjoner
status: Gyldig

Grue kommune
type: Concept
in scheme: Organisasjoner
top concept of: Organisasjoner
status: Gyldig

Guovdageainnu suohkan / Kautokeino kommune
type: Concept
in scheme: Organisasjoner
top concept of: Organisasjoner
status: Gyldig

Røros kommune
type: Concept
in scheme: Organisasjoner
top concept of: Organisasjoner
status: Gyldig

Storfjord kommune
type: Concept
in scheme: Organisasjoner
top concept of: Organisasjoner
status: Gyldig

Politi og lensmannsetaten
type: Concept
in scheme: Organisasjoner
top concept of: Organisasjoner
definition: Politi- og lensmannsetaten består av Politidirektoratet, dei 27 politidistrikta og dei sju særorgana til politiet.
description: Politi- og lensmannsetaten består av Politidirektoratet, dei 27 politidistrikta og dei sju særorgana til politiet.
status: Gyldig

Salangen kommune
type: Concept
in scheme: Organisasjoner
top concept of: Organisasjoner
status: Gyldig

Aremark kommune
type: Concept
in scheme: Organisasjoner
top concept of: Organisasjoner
status: Gyldig

Leirfjord kommune
type: Concept
in scheme: Organisasjoner
top concept of: Organisasjoner
status: Gyldig

Norsk institutt for vannforskning
type: Concept
in scheme: Organisasjoner
top concept of: Organisasjoner
definition: NIVA er et miljøforskningsinstitutt som arbeider med forskning, undersøkelser, utvikling og utredninger knyttet til ferskvann, kyst og hav.
description: NIVA er et miljøforskningsinstitutt som arbeider med forskning, undersøkelser, utvikling og utredninger knyttet til ferskvann, kyst og hav.
status: Gyldig

Eidskog kommune
type: Concept
in scheme: Organisasjoner
top concept of: Organisasjoner
status: Gyldig

Eidfjord kommune
type: Concept
in scheme: Organisasjoner
top concept of: Organisasjoner
status: Gyldig

Klepp kommune
type: Concept
in scheme: Organisasjoner
top concept of: Organisasjoner
status: Gyldig

Norge i bilder
type: Concept
in scheme: Organisasjoner
top concept of: Organisasjoner
definition: Norge i bilder er et samarbeid mellom Skog og landskap, Statens vegvesen og Statens kartverk
description: Norge i bilder er et samarbeid mellom Skog og landskap, Statens vegvesen og Statens kartverk
status: Gyldig

Modalen kommune
type: Concept
in scheme: Organisasjoner
top concept of: Organisasjoner
status: Gyldig

Havforskningsinstituttet
type: Concept
in scheme: Organisasjoner
top concept of: Organisasjoner
definition: Hovedansvaret til Havforskningsinstituttet er å forske for å kunne gi råd til det offentlige om akvakultur og om økosystemene i Barentshavet, Norskehavet, Nordsjøen og den norske kystsonen.
description: Hovedansvaret til Havforskningsinstituttet er å forske for å kunne gi råd til det offentlige om akvakultur og om økosystemene i Barentshavet, Norskehavet, Nordsjøen og den norske kystsonen.
status: Gyldig

Nesna kommune
type: Concept
in scheme: Organisasjoner
top concept of: Organisasjoner
status: Gyldig

Øvre Eiker kommune
type: Concept
in scheme: Organisasjoner
top concept of: Organisasjoner
status: Gyldig

Nore og Uvdal kommune
type: Concept
in scheme: Organisasjoner
top concept of: Organisasjoner
status: Gyldig

Fauske kommune
type: Concept
in scheme: Organisasjoner
top concept of: Organisasjoner
status: Gyldig

Evje og Hornnes kommune
type: Concept
in scheme: Organisasjoner
top concept of: Organisasjoner
status: Gyldig

Nord-Fron kommune
type: Concept
in scheme: Organisasjoner
top concept of: Organisasjoner
status: Gyldig

Austrheim kommune
type: Concept
in scheme: Organisasjoner
top concept of: Organisasjoner
status: Gyldig

Flesberg kommune
type: Concept
in scheme: Organisasjoner
top concept of: Organisasjoner
status: Gyldig

Båtsfjord kommune
type: Concept
in scheme: Organisasjoner
top concept of: Organisasjoner
status: Gyldig

Fiskeridirektoratet
type: Concept
in scheme: Organisasjoner
top concept of: Organisasjoner
definition: Fiskeridirektoratet skal bidra til å sikre rammebetingelsene for en lønnsom og bærekraftig fiskeri- og havbruksnæring samt annet marint basert næringsliv.
description: Fiskeridirektoratet skal bidra til å sikre rammebetingelsene for en lønnsom og bærekraftig fiskeri- og havbruksnæring samt annet marint basert næringsliv.
status: Gyldig

Sel kommune
type: Concept
in scheme: Organisasjoner
top concept of: Organisasjoner
status: Gyldig

Knutepunkt Sørlandet
type: Concept
in scheme: Organisasjoner
top concept of: Organisasjoner
definition: Knutepunkt Sørlandet er et interkommunalt samarbeidsorgan for de sju kommunene Lillesand, Birkenes, Iveland, Vennesla, Kristiansand, Søgne og Songdalen.
description: Knutepunkt Sørlandet er et interkommunalt samarbeidsorgan for de sju kommunene Lillesand, Birkenes, Iveland, Vennesla, Kristiansand, Søgne og Songdalen.
status: Gyldig

Gjerdrum kommune
type: Concept
in scheme: Organisasjoner
top concept of: Organisasjoner
status: Gyldig

Sunndal kommune
type: Concept
in scheme: Organisasjoner
top concept of: Organisasjoner
status: Gyldig

Vestre toten kommune
type: Concept
in scheme: Organisasjoner
top concept of: Organisasjoner
status: Gyldig

Lunner kommune
type: Concept
in scheme: Organisasjoner
top concept of: Organisasjoner
status: Gyldig

Vardø kommune
type: Concept
in scheme: Organisasjoner
top concept of: Organisasjoner
status: Gyldig

Departementene
type: Concept
in scheme: Organisasjoner
top concept of: Organisasjoner
definition: Dette er en overbygning for administrasjonen i alle departement. Det er Kommunal- og distriksdepartementet som er avtalepart for alle departementenes Norge digitalt-avtale.
description: Dette er en overbygning for administrasjonen i alle departement. Det er Kommunal- og distriksdepartementet som er avtalepart for alle departementenes Norge digitalt-avtale.
status: Gyldig

Nasjonal kommunikasjonsmyndighet
type: Concept
in scheme: Organisasjoner
top concept of: Organisasjoner
definition: Nasjonal kommunikasjonsmyndighet driver tilsyn med dem som tilbyr post- og teletjenester.
description: Nasjonal kommunikasjonsmyndighet driver tilsyn med dem som tilbyr post- og teletjenester.
status: Gyldig

Namsskogan kommune
type: Concept
in scheme: Organisasjoner
top concept of: Organisasjoner
status: Gyldig

Gran kommune
type: Concept
in scheme: Organisasjoner
top concept of: Organisasjoner
status: Gyldig

Det frivillige Skyttervesen
type: Concept
in scheme: Organisasjoner
top concept of: Organisasjoner
definition: Det frivillige Skyttervesens formål er å fremme god våpenkultur og praktiske skyteferdigheter, samt sikre tilgang til en desentralisert skytebanestruktur, til nytte for Forsvaret og samfunnet for øvrig.
description: Det frivillige Skyttervesens formål er å fremme god våpenkultur og praktiske skyteferdigheter, samt sikre tilgang til en desentralisert skytebanestruktur, til nytte for Forsvaret og samfunnet for øvrig.
status: Gyldig

eKommune Sunnmøre
type: Concept
in scheme: Organisasjoner
top concept of: Organisasjoner
definition: De tre kommunene Ålesund, Sula og Haram innenfor eKommune Sunnmøre samarbeider om bruk og utvikling av webkartløsninger.
description: De tre kommunene Ålesund, Sula og Haram innenfor eKommune Sunnmøre samarbeider om bruk og utvikling av webkartløsninger.
status: Gyldig

Engerdal kommune
type: Concept
in scheme: Organisasjoner
top concept of: Organisasjoner
status: Gyldig

Gloppen kommune
type: Concept
in scheme: Organisasjoner
top concept of: Organisasjoner
status: Gyldig

Lebesby kommune
type: Concept
in scheme: Organisasjoner
top concept of: Organisasjoner
status: Gyldig

Etne kommune
type: Concept
in scheme: Organisasjoner
top concept of: Organisasjoner
status: Gyldig

Bergen kommune
type: Concept
in scheme: Organisasjoner
top concept of: Organisasjoner
status: Gyldig

Tønsberg kommune
type: Concept
in scheme: Organisasjoner
top concept of: Organisasjoner
status: Gyldig

Eigersund kommune
type: Concept
in scheme: Organisasjoner
top concept of: Organisasjoner
status: Gyldig

Rauma kommune
type: Concept
in scheme: Organisasjoner
top concept of: Organisasjoner
status: Gyldig

Balsfjord kommune
type: Concept
in scheme: Organisasjoner
top concept of: Organisasjoner
status: Gyldig

Bø kommune
type: Concept
in scheme: Organisasjoner
top concept of: Organisasjoner
status: Gyldig

Holmestrand kommune
type: Concept
in scheme: Organisasjoner
top concept of: Organisasjoner
status: Gyldig

Universitetet i Oslo
type: Concept
in scheme: Organisasjoner
top concept of: Organisasjoner
status: Gyldig

Rødøy kommune
type: Concept
in scheme: Organisasjoner
top concept of: Organisasjoner
status: Gyldig

Ringsaker kommune
type: Concept
in scheme: Organisasjoner
top concept of: Organisasjoner
status: Gyldig

Drammen kommune
type: Concept
in scheme: Organisasjoner
top concept of: Organisasjoner
status: Gyldig

Vik kommune
type: Concept
in scheme: Organisasjoner
top concept of: Organisasjoner
status: Gyldig

Kviteseid kommune
type: Concept
in scheme: Organisasjoner
top concept of: Organisasjoner
status: Gyldig

Gratangen-Lavangen-Salangen
type: Concept
in scheme: Organisasjoner
top concept of: Organisasjoner
definition: Gratangen, Lavangen og Salangen kommuner har inngått et kartsamarbeid
description: Gratangen, Lavangen og Salangen kommuner har inngått et kartsamarbeid
status: Gyldig

Stange kommune
type: Concept
in scheme: Organisasjoner
top concept of: Organisasjoner
status: Gyldig

Ås kommune
type: Concept
in scheme: Organisasjoner
top concept of: Organisasjoner
status: Gyldig

Eidsvoll kommune
type: Concept
in scheme: Organisasjoner
top concept of: Organisasjoner
status: Gyldig

Norsk institutt for skog og landskap
type: Concept
in scheme: Organisasjoner
top concept of: Organisasjoner
definition: Norsk institutt for skog og landskap er et nasjonalt institutt for kunnskap om arealressurser. Instituttet formidler kunnskap til myndigheter, næringsliv og allmennhet.
description: Norsk institutt for skog og landskap er et nasjonalt institutt for kunnskap om arealressurser. Instituttet formidler kunnskap til myndigheter, næringsliv og allmennhet.
status: Erstattet

Årdal kommune
type: Concept
in scheme: Organisasjoner
top concept of: Organisasjoner
status: Gyldig

Hemsedal kommune
type: Concept
in scheme: Organisasjoner
top concept of: Organisasjoner
status: Gyldig

Hitra kommune
type: Concept
in scheme: Organisasjoner
top concept of: Organisasjoner
status: Gyldig

Sauda kommune
type: Concept
in scheme: Organisasjoner
top concept of: Organisasjoner
status: Gyldig

Kommunal- og distriktsdepartementet
type: Concept
in scheme: Organisasjoner
top concept of: Organisasjoner
definition: Departementet (KDD) har ansvar for bustadpolitikk, plan- og bygningslova, kart- og geodatapolitikken, kommuneøkonomi og lokalforvaltning, IKT- og forvaltningspolitikk, regional- og distriktspolitikk, valgjennomføring, politikken overfor samar og nasjonale minoritetar, statleg arbeidsgivarpolitikk og statleg bygg- og eigedomsforvaltning. KDD ivaretar Norge digitalt-avtalen for administrasjonen i alle departementene (ikke de underliggende etater)
description: Departementet (KDD) har ansvar for bustadpolitikk, plan- og bygningslova, kart- og geodatapolitikken, kommuneøkonomi og lokalforvaltning, IKT- og forvaltningspolitikk, regional- og distriktspolitikk, valgjennomføring, politikken overfor samar og nasjonale minoritetar, statleg arbeidsgivarpolitikk og statleg bygg- og eigedomsforvaltning. KDD ivaretar Norge digitalt-avtalen for administrasjonen i alle departementene (ikke de underliggende etater)
status: Gyldig

Modum kommune
type: Concept
in scheme: Organisasjoner
top concept of: Organisasjoner
status: Gyldig

Norsk Zoologisk Forening
type: Concept
in scheme: Organisasjoner
top concept of: Organisasjoner
status: Gyldig

Mattilsynet
type: Concept
in scheme: Organisasjoner
top concept of: Organisasjoner
definition: Mattilsynet er eit statleg, landsdekkjande forvaltingsorgan som er med på å sikre forbrukarane trygg mat og trygt drikkevatn.
description: Mattilsynet er eit statleg, landsdekkjande forvaltingsorgan som er med på å sikre forbrukarane trygg mat og trygt drikkevatn.
status: Gyldig

Kvænangen kommune
type: Concept
in scheme: Organisasjoner
top concept of: Organisasjoner
status: Gyldig

Kystverket
type: Concept
in scheme: Organisasjoner
top concept of: Organisasjoner
definition: Hovudformålet er å sørgje for sikker og effektiv ferdsle i farleier langs kysten og inn til hamner, og ein nasjonal beredskap mot akutt forureining.
description: Hovudformålet er å sørgje for sikker og effektiv ferdsle i farleier langs kysten og inn til hamner, og ein nasjonal beredskap mot akutt forureining.
status: Gyldig

Harstad kommune
type: Concept
in scheme: Organisasjoner
top concept of: Organisasjoner
status: Gyldig

Berlevåg kommune
type: Concept
in scheme: Organisasjoner
top concept of: Organisasjoner
status: Gyldig

Averøy kommune
type: Concept
in scheme: Organisasjoner
top concept of: Organisasjoner
status: Gyldig

Tynset kommune
type: Concept
in scheme: Organisasjoner
top concept of: Organisasjoner
status: Gyldig

Hvaler kommune
type: Concept
in scheme: Organisasjoner
top concept of: Organisasjoner
status: Gyldig

Ål kommune
type: Concept
in scheme: Organisasjoner
top concept of: Organisasjoner
status: Gyldig

Askøy kommune
type: Concept
in scheme: Organisasjoner
top concept of: Organisasjoner
status: Gyldig

Åmli kommune
type: Concept
in scheme: Organisasjoner
top concept of: Organisasjoner
status: Gyldig

Orkide
type: Concept
in scheme: Organisasjoner
top concept of: Organisasjoner
definition: Orkidé er et samarbeid mellom kommunene Aure, Averøy, Eide, Gjemnes, Halsa, Kristiansund, Nesset, Rindal, Smøla, Sunndal, Surnadal og Tingvoll.
description: Orkidé er et samarbeid mellom kommunene Aure, Averøy, Eide, Gjemnes, Halsa, Kristiansund, Nesset, Rindal, Smøla, Sunndal, Surnadal og Tingvoll.
status: Gyldig

Statsforvalteren i Troms og Finnmark
type: Concept
in scheme: Organisasjoner
top concept of: Organisasjoner
status: Tilbaketrukket

Tromsø kommune
type: Concept
in scheme: Organisasjoner
top concept of: Organisasjoner
status: Gyldig

Fonnakart
type: Concept
in scheme: Organisasjoner
top concept of: Organisasjoner
definition: Kommunalt samarbeid mellom kommuner i Rogaland og tidligere Hordaland fylke
description: Kommunalt samarbeid mellom kommuner i Rogaland og tidligere Hordaland fylke
status: Sendt inn

Hægebostad kommune
type: Concept
in scheme: Organisasjoner
top concept of: Organisasjoner
status: Gyldig

Deanu gielda / Tana kommune
type: Concept
in scheme: Organisasjoner
top concept of: Organisasjoner
status: Gyldig

Stryn kommune
type: Concept
in scheme: Organisasjoner
top concept of: Organisasjoner
status: Gyldig

Hamar kommune
type: Concept
in scheme: Organisasjoner
top concept of: Organisasjoner
status: Gyldig

Midt-Telemark kommune
type: Concept
in scheme: Organisasjoner
top concept of: Organisasjoner
status: Gyldig

Vadsø kommune
type: Concept
in scheme: Organisasjoner
top concept of: Organisasjoner
status: Gyldig

Folldal kommune
type: Concept
in scheme: Organisasjoner
top concept of: Organisasjoner
status: Gyldig

Ørsta kommune
type: Concept
in scheme: Organisasjoner
top concept of: Organisasjoner
status: Gyldig

Alta kommune
type: Concept
in scheme: Organisasjoner
top concept of: Organisasjoner
status: Gyldig

Nome kommune
type: Concept
in scheme: Organisasjoner
top concept of: Organisasjoner
status: Gyldig

Rakkestad kommune
type: Concept
in scheme: Organisasjoner
top concept of: Organisasjoner
status: Gyldig

Andøy kommune
type: Concept
in scheme: Organisasjoner
top concept of: Organisasjoner
status: Gyldig

Oppdal kommune
type: Concept
in scheme: Organisasjoner
top concept of: Organisasjoner
status: Gyldig

Åmot kommune
type: Concept
in scheme: Organisasjoner
top concept of: Organisasjoner
status: Gyldig

Bygland kommune
type: Concept
in scheme: Organisasjoner
top concept of: Organisasjoner
status: Gyldig

Time kommune
type: Concept
in scheme: Organisasjoner
top concept of: Organisasjoner
status: Gyldig

Bamble kommune
type: Concept
in scheme: Organisasjoner
top concept of: Organisasjoner
status: Gyldig

NORSAR
type: Concept
in scheme: Organisasjoner
top concept of: Organisasjoner
definition: NORSAR er en internasjonalt anerkjent og uavhengig forskningsstiftelse. NORSAR er spesialister på seismologi og seismisk overvåkning.
description: NORSAR er en internasjonalt anerkjent og uavhengig forskningsstiftelse. NORSAR er spesialister på seismologi og seismisk overvåkning.
status: Sendt inn

Gjøvik kommune
type: Concept
in scheme: Organisasjoner
top concept of: Organisasjoner
status: Gyldig

Direktoratet for samfunnssikkerhet og beredskap
type: Concept
in scheme: Organisasjoner
top concept of: Organisasjoner
definition: DSBs ansvar på samfunnstryggleiksområdet omfattar nasjonal, regional og lokal tryggleik og beredskap, brann- og eltryggleik, industri- og næringslivstryggleik, farlege stoff, og produkt- og forbrukartryggleik.
description: DSBs ansvar på samfunnstryggleiksområdet omfattar nasjonal, regional og lokal tryggleik og beredskap, brann- og eltryggleik, industri- og næringslivstryggleik, farlege stoff, og produkt- og forbrukartryggleik.
status: Gyldig

Norges teknisk-naturvitenskapelige universitet
type: Concept
in scheme: Organisasjoner
top concept of: Organisasjoner
status: Gyldig

Vega kommune
type: Concept
in scheme: Organisasjoner
top concept of: Organisasjoner
status: Gyldig

Indre Fosen kommune
type: Concept
in scheme: Organisasjoner
top concept of: Organisasjoner
status: Gyldig

Nissedal kommune
type: Concept
in scheme: Organisasjoner
top concept of: Organisasjoner
status: Gyldig

Hole kommune
type: Concept
in scheme: Organisasjoner
top concept of: Organisasjoner
status: Gyldig

Skiptvet kommune
type: Concept
in scheme: Organisasjoner
top concept of: Organisasjoner
status: Gyldig

Kvinnherad kommune
type: Concept
in scheme: Organisasjoner
top concept of: Organisasjoner
status: Gyldig

Evenes kommune
type: Concept
in scheme: Organisasjoner
top concept of: Organisasjoner
status: Gyldig

Øygarden kommune
type: Concept
in scheme: Organisasjoner
top concept of: Organisasjoner
status: Gyldig

Bjerkreim kommune
type: Concept
in scheme: Organisasjoner
top concept of: Organisasjoner
status: Gyldig

Skatteetaten
type: Concept
in scheme: Organisasjoner
top concept of: Organisasjoner
status: Sendt inn

Giske kommune
type: Concept
in scheme: Organisasjoner
top concept of: Organisasjoner
status: Gyldig

Skjåk kommune
type: Concept
in scheme: Organisasjoner
top concept of: Organisasjoner
status: Gyldig

Våler (Østfold) kommune
type: Concept
in scheme: Organisasjoner
top concept of: Organisasjoner
status: Gyldig

Tolga kommune
type: Concept
in scheme: Organisasjoner
top concept of: Organisasjoner
status: Gyldig

Nordreisa kommune
type: Concept
in scheme: Organisasjoner
top concept of: Organisasjoner
status: Gyldig

Grane kommune
type: Concept
in scheme: Organisasjoner
top concept of: Organisasjoner
status: Gyldig

Nordhordland digitalt
type: Concept
in scheme: Organisasjoner
top concept of: Organisasjoner
status: Gyldig

Geoforum
type: Concept
in scheme: Organisasjoner
top concept of: Organisasjoner
definition: GeoForum er en landsomfattende, ideell interesseorganisasjon for personer og bedrifter/etater som har interesse innen geografisk informasjon (geomatikk).
description: GeoForum er en landsomfattende, ideell interesseorganisasjon for personer og bedrifter/etater som har interesse innen geografisk informasjon (geomatikk).
status: Gyldig

Holtålen kommune
type: Concept
in scheme: Organisasjoner
top concept of: Organisasjoner
status: Gyldig

Voss kommune
type: Concept
in scheme: Organisasjoner
top concept of: Organisasjoner
status: Gyldig

Bremanger kommune
type: Concept
in scheme: Organisasjoner
top concept of: Organisasjoner
status: Gyldig

Forsvaret
type: Concept
in scheme: Organisasjoner
top concept of: Organisasjoner
definition: Forsvarets organisasjon består av 21 driftsenheter med et vidt spekter av arbeidsoppgaver.
description: Forsvarets organisasjon består av 21 driftsenheter med et vidt spekter av arbeidsoppgaver.
status: Gyldig

Nordre land kommune
type: Concept
in scheme: Organisasjoner
top concept of: Organisasjoner
status: Gyldig

Jernbaneverket (erstattet)
type: Concept
in scheme: Organisasjoner
top concept of: Organisasjoner
definition: Erstattet av: Bane NOR
description: Erstattet av: Bane NOR
status: Erstattet

Råde kommune
type: Concept
in scheme: Organisasjoner
top concept of: Organisasjoner
status: Gyldig

Birdlife Norge
type: Concept
in scheme: Organisasjoner
top concept of: Organisasjoner
definition: Arbeide aktivt for naturvern, særlig rettet mot fuglefaunaen. Fremme interessen for og bedre kunnskapen om fuglene og deres livsmiljø. Fungere som et bindeledd mellom vårt lands fugleinteresserte og stimulere til ulike ornitologiske undersøkelser og aktiviteter.
description: Arbeide aktivt for naturvern, særlig rettet mot fuglefaunaen. Fremme interessen for og bedre kunnskapen om fuglene og deres livsmiljø. Fungere som et bindeledd mellom vårt lands fugleinteresserte og stimulere til ulike ornitologiske undersøkelser og aktiviteter.
status: Gyldig

Sarpsborg kommune
type: Concept
in scheme: Organisasjoner
top concept of: Organisasjoner
status: Gyldig

Osen kommune
type: Concept
in scheme: Organisasjoner
top concept of: Organisasjoner
status: Gyldig

Lillestrøm kommune
type: Concept
in scheme: Organisasjoner
top concept of: Organisasjoner
status: Gyldig

Geonorge
type: Concept
in scheme: Organisasjoner
top concept of: Organisasjoner
status: Gyldig

Grong kommune
type: Concept
in scheme: Organisasjoner
top concept of: Organisasjoner
status: Gyldig

Valle kommune
type: Concept
in scheme: Organisasjoner
top concept of: Organisasjoner
status: Gyldig

Ringebu kommune
type: Concept
in scheme: Organisasjoner
top concept of: Organisasjoner
status: Gyldig

Nordkapp kommune
type: Concept
in scheme: Organisasjoner
top concept of: Organisasjoner
status: Gyldig

Bærum Elveforum
type: Concept
in scheme: Organisasjoner
top concept of: Organisasjoner
status: Sendt inn

Kulturdepartementet
type: Concept
in scheme: Organisasjoner
top concept of: Organisasjoner
definition: Kulturdepartementet (KUD) har ansvar for den statlige politikken og forvaltningen på områdene kultur, opphavsrett, kirke, medier, idrett, frivillig virksomhet, tros- og livssynssamfunn og pengespill og lotteri.
description: Kulturdepartementet (KUD) har ansvar for den statlige politikken og forvaltningen på områdene kultur, opphavsrett, kirke, medier, idrett, frivillig virksomhet, tros- og livssynssamfunn og pengespill og lotteri.
status: Gyldig

Løten kommune
type: Concept
in scheme: Organisasjoner
top concept of: Organisasjoner
status: Gyldig

Den norske turistforening
type: Concept
in scheme: Organisasjoner
top concept of: Organisasjoner
definition: DNT arbeider for å fremme et enkelt, aktivt, allsidig og miljøvennlig friluftsliv og for å bevare natur og kulturverdier.
description: DNT arbeider for å fremme et enkelt, aktivt, allsidig og miljøvennlig friluftsliv og for å bevare natur og kulturverdier.
status: Gyldig

Lørenskog kommune
type: Concept
in scheme: Organisasjoner
top concept of: Organisasjoner
status: Gyldig

Strand kommune
type: Concept
in scheme: Organisasjoner
top concept of: Organisasjoner
status: Gyldig

Leka kommune
type: Concept
in scheme: Organisasjoner
top concept of: Organisasjoner
status: Gyldig

Aurskog-Høland kommune
type: Concept
in scheme: Organisasjoner
top concept of: Organisasjoner
status: Gyldig

Dielddanuori suohkan/Tjeldsund kommune
type: Concept
in scheme: Organisasjoner
top concept of: Organisasjoner
status: Gyldig

Værøy kommune
type: Concept
in scheme: Organisasjoner
top concept of: Organisasjoner
status: Gyldig

Kommunene
type: Concept
in scheme: Organisasjoner
top concept of: Organisasjoner
definition: Norske kommuner
description: Norske kommuner
status: Gyldig

Statsforvaltaren i Møre og Romsdal
type: Concept
in scheme: Organisasjoner
top concept of: Organisasjoner
status: Tilbaketrukket

Jernbanedirektoratet
type: Concept
in scheme: Organisasjoner
top concept of: Organisasjoner
status: Gyldig

Rana kommune
type: Concept
in scheme: Organisasjoner
top concept of: Organisasjoner
status: Gyldig

Statens strålevern
type: Concept
in scheme: Organisasjoner
top concept of: Organisasjoner
definition: Statens strålevern er fagmyndigheit på område strålevern og atomtryggleik.
description: Statens strålevern er fagmyndigheit på område strålevern og atomtryggleik.
status: Erstattet

Vanylven kommune
type: Concept
in scheme: Organisasjoner
top concept of: Organisasjoner
status: Gyldig

Digitaliseringsdirektoratet
type: Concept
in scheme: Organisasjoner
top concept of: Organisasjoner
status: Gyldig

Finlands meteorologiske institutt
type: Concept
in scheme: Organisasjoner
top concept of: Organisasjoner
status: Gyldig

Molde kommune
type: Concept
in scheme: Organisasjoner
top concept of: Organisasjoner
status: Gyldig

Lom kommune
type: Concept
in scheme: Organisasjoner
top concept of: Organisasjoner
status: Gyldig

Statskog
type: Concept
in scheme: Organisasjoner
top concept of: Organisasjoner
definition: Statskog har til formål selv, gjennom deltakelse eller i samarbeid med andre, å forvalte, drive og utvikle statlige skog- og fjelleiendommer med tilhørende ressurser og annen tilgrensende virksomhet.
description: Statskog har til formål selv, gjennom deltakelse eller i samarbeid med andre, å forvalte, drive og utvikle statlige skog- og fjelleiendommer med tilhørende ressurser og annen tilgrensende virksomhet.
status: Gyldig

Nærøysund kommune
type: Concept
in scheme: Organisasjoner
top concept of: Organisasjoner
status: Gyldig

Ringerike kommune
type: Concept
in scheme: Organisasjoner
top concept of: Organisasjoner
status: Gyldig

Vindafjord kommune
type: Concept
in scheme: Organisasjoner
top concept of: Organisasjoner
status: Gyldig

Fyresdal kommune
type: Concept
in scheme: Organisasjoner
top concept of: Organisasjoner
status: Gyldig

Larvik kommune
type: Concept
in scheme: Organisasjoner
top concept of: Organisasjoner
status: Gyldig

Kragerø kommune
type: Concept
in scheme: Organisasjoner
top concept of: Organisasjoner
status: Gyldig

Lyngdal kommune
type: Concept
in scheme: Organisasjoner
top concept of: Organisasjoner
status: Gyldig

Vesterålskommunene
type: Concept
in scheme: Organisasjoner
top concept of: Organisasjoner
definition: Interkommunalt samarbeid mellom kommunene Andøy, Bø, Hadsel, Lødingen, Sortland og Øksnes
description: Interkommunalt samarbeid mellom kommunene Andøy, Bø, Hadsel, Lødingen, Sortland og Øksnes
status: Gyldig

Askvoll kommune
type: Concept
in scheme: Organisasjoner
top concept of: Organisasjoner
status: Gyldig

Nordland fylkeskommune
type: Concept
in scheme: Organisasjoner
top concept of: Organisasjoner
status: Gyldig

Bokn kommune
type: Concept
in scheme: Organisasjoner
top concept of: Organisasjoner
status: Gyldig

Tysnes kommune
type: Concept
in scheme: Organisasjoner
top concept of: Organisasjoner
status: Gyldig

Træna kommune
type: Concept
in scheme: Organisasjoner
top concept of: Organisasjoner
status: Gyldig

Akvaplan-niva
type: Concept
in scheme: Organisasjoner
top concept of: Organisasjoner
status: Gyldig

Sysselmesteren på Svalbard
type: Concept
in scheme: Organisasjoner
top concept of: Organisasjoner
definition: Sysselmannen på Svalbard har mange og varierte oppgaver. Hovedoppgavene er knyttet til politi- og miljøvernarbeid.
description: Sysselmannen på Svalbard har mange og varierte oppgaver. Hovedoppgavene er knyttet til politi- og miljøvernarbeid.
status: Gyldig

Hadsel kommune
type: Concept
in scheme: Organisasjoner
top concept of: Organisasjoner
status: Gyldig

Bykle kommune
type: Concept
in scheme: Organisasjoner
top concept of: Organisasjoner
status: Gyldig

Malvik kommune
type: Concept
in scheme: Organisasjoner
top concept of: Organisasjoner
status: Gyldig

Fredrikstad kommune
type: Concept
in scheme: Organisasjoner
top concept of: Organisasjoner
status: Gyldig

Riksrevisjonen
type: Concept
in scheme: Organisasjoner
top concept of: Organisasjoner
status: Gyldig

Randaberg kommune
type: Concept
in scheme: Organisasjoner
top concept of: Organisasjoner
status: Gyldig

Iveland kommune
type: Concept
in scheme: Organisasjoner
top concept of: Organisasjoner
status: Gyldig

Tinn kommune
type: Concept
in scheme: Organisasjoner
top concept of: Organisasjoner
status: Gyldig

Ullensvang kommune
type: Concept
in scheme: Organisasjoner
top concept of: Organisasjoner
status: Gyldig

Rogaland fylkeskommune
type: Concept
in scheme: Organisasjoner
top concept of: Organisasjoner
status: Gyldig

Hyllestad kommune
type: Concept
in scheme: Organisasjoner
top concept of: Organisasjoner
status: Gyldig

Statsforvaltaren i Rogaland
type: Concept
in scheme: Organisasjoner
top concept of: Organisasjoner
status: Tilbaketrukket

Karlsøy kommune
type: Concept
in scheme: Organisasjoner
top concept of: Organisasjoner
status: Gyldig

Sveio kommune
type: Concept
in scheme: Organisasjoner
top concept of: Organisasjoner
status: Gyldig

Herøy kommune - Nordland
type: Concept
in scheme: Organisasjoner
top concept of: Organisasjoner
status: Gyldig

Grimstad kommune
type: Concept
in scheme: Organisasjoner
top concept of: Organisasjoner
status: Gyldig

Kunnskapsdepartementet
type: Concept
in scheme: Organisasjoner
top concept of: Organisasjoner
status: Gyldig

Ibestad kommune
type: Concept
in scheme: Organisasjoner
top concept of: Organisasjoner
status: Gyldig

Alver kommune
type: Concept
in scheme: Organisasjoner
top concept of: Organisasjoner
status: Gyldig

Dovre kommune
type: Concept
in scheme: Organisasjoner
top concept of: Organisasjoner
status: Gyldig

Sogndal kommune
type: Concept
in scheme: Organisasjoner
top concept of: Organisasjoner
status: Gyldig

Kvitsøy kommune
type: Concept
in scheme: Organisasjoner
top concept of: Organisasjoner
status: Gyldig

Flå kommune
type: Concept
in scheme: Organisasjoner
top concept of: Organisasjoner
status: Gyldig

Direktoratet for mineralforvaltning
type: Concept
in scheme: Organisasjoner
top concept of: Organisasjoner
definition: Direktoratet for mineralforvaltning med Bergmesteren for Svalbard (DMF) forvalter lov om erverv og utvinning av mineralske ressurser (mineralloven) og Bergverksordningen for Svalbard.
description: Direktoratet for mineralforvaltning med Bergmesteren for Svalbard (DMF) forvalter lov om erverv og utvinning av mineralske ressurser (mineralloven) og Bergverksordningen for Svalbard.
status: Gyldig

Ulstein kommune
type: Concept
in scheme: Organisasjoner
top concept of: Organisasjoner
status: Gyldig

Hemnes kommune
type: Concept
in scheme: Organisasjoner
top concept of: Organisasjoner
status: Gyldig

Aure kommune
type: Concept
in scheme: Organisasjoner
top concept of: Organisasjoner
status: Gyldig

Suldal kommune
type: Concept
in scheme: Organisasjoner
top concept of: Organisasjoner
status: Gyldig

Asker kommune
type: Concept
in scheme: Organisasjoner
top concept of: Organisasjoner
status: Gyldig

Øyer kommune
type: Concept
in scheme: Organisasjoner
top concept of: Organisasjoner
status: Gyldig

Sola kommune
type: Concept
in scheme: Organisasjoner
top concept of: Organisasjoner
status: Gyldig

Høyanger kommune
type: Concept
in scheme: Organisasjoner
top concept of: Organisasjoner
status: Gyldig

Aurland kommune
type: Concept
in scheme: Organisasjoner
top concept of: Organisasjoner
status: Gyldig

Rennebu kommune
type: Concept
in scheme: Organisasjoner
top concept of: Organisasjoner
status: Gyldig

Dyrøy kommune
type: Concept
in scheme: Organisasjoner
top concept of: Organisasjoner
status: Gyldig

Innherred kommunesamarbeid
type: Concept
in scheme: Organisasjoner
top concept of: Organisasjoner
definition: Interkommunalt samarbeid mellom Levanger og Verdal kommuner, Nord-Trøndelag. Erstatter Innherred samkommune.
description: Interkommunalt samarbeid mellom Levanger og Verdal kommuner, Nord-Trøndelag. Erstatter Innherred samkommune.
status: Gyldig

Setesdal
type: Concept
in scheme: Organisasjoner
top concept of: Organisasjoner
definition: Kartportalen Setesdal er et samarbeid mellom kommunene Bygland, Bykle, Evje og Hornes, Valle.
description: Kartportalen Setesdal er et samarbeid mellom kommunene Bygland, Bykle, Evje og Hornes, Valle.
status: Gyldig

Verdal kommune
type: Concept
in scheme: Organisasjoner
top concept of: Organisasjoner
status: Gyldig

Lurøy kommune
type: Concept
in scheme: Organisasjoner
top concept of: Organisasjoner
status: Gyldig

Sigdal kommune
type: Concept
in scheme: Organisasjoner
top concept of: Organisasjoner
status: Gyldig

Beiarn kommune
type: Concept
in scheme: Organisasjoner
top concept of: Organisasjoner
status: Gyldig

Kongsberg kommune
type: Concept
in scheme: Organisasjoner
top concept of: Organisasjoner
status: Gyldig

Nesbyen kommune
type: Concept
in scheme: Organisasjoner
top concept of: Organisasjoner
status: Gyldig

Hordaland fylkeskommune
type: Concept
in scheme: Organisasjoner
top concept of: Organisasjoner
status: Gyldig

Salten regionråd
type: Concept
in scheme: Organisasjoner
top concept of: Organisasjoner
definition: Salten Regionråd er et samarbeidsorgan mellom kommunene Beiarn, Bodø, Fauske, Gildeskål, Hamarøy, Meløy, Saltdal, Steigen og Sørfold. Hovedmålsetningene for det interkommunale samarbeidet er å styrke næringsgrunnlaget og den offentlige tjenesteyting.
description: Salten Regionråd er et samarbeidsorgan mellom kommunene Beiarn, Bodø, Fauske, Gildeskål, Hamarøy, Meløy, Saltdal, Steigen og Sørfold. Hovedmålsetningene for det interkommunale samarbeidet er å styrke næringsgrunnlaget og den offentlige tjenesteyting.
status: Gyldig

Gjøvik-Land-Toten
type: Concept
in scheme: Organisasjoner
top concept of: Organisasjoner
definition: Kartsamarbeidet Gjøvik - Land - Toten er et samarbeid mellom kommunene Gjøvik, Nordre Land, Søndre Land, Vestre Toten og Østre Toten.
description: Kartsamarbeidet Gjøvik - Land - Toten er et samarbeid mellom kommunene Gjøvik, Nordre Land, Søndre Land, Vestre Toten og Østre Toten.
status: Gyldig

Norges arktiske universitet
type: Concept
in scheme: Organisasjoner
top concept of: Organisasjoner
status: Gyldig

Stavanger kommune
type: Concept
in scheme: Organisasjoner
top concept of: Organisasjoner
status: Gyldig

Universitetet i Agder
type: Concept
in scheme: Organisasjoner
top concept of: Organisasjoner
status: Gyldig

Våler (Innlandet) kommune
type: Concept
in scheme: Organisasjoner
top concept of: Organisasjoner
status: Gyldig

SIKT - Kunnskapssektorens tjenesteleverandør
type: Concept
in scheme: Organisasjoner
top concept of: Organisasjoner
definition: Sikt utvikler, anskaffer og leverer tjenester til utdanning og forskning. Ivaretar utdanningssektorens Norge digitalt-medlemskap
description: Sikt utvikler, anskaffer og leverer tjenester til utdanning og forskning. Ivaretar utdanningssektorens Norge digitalt-medlemskap
status: Gyldig

Vågan kommune
type: Concept
in scheme: Organisasjoner
top concept of: Organisasjoner
status: Gyldig

Værnesregionen
type: Concept
in scheme: Organisasjoner
top concept of: Organisasjoner
definition: Værnesregionen er et samarbeid mellom de seks kommunene Tydal, Selbu, Malvik, Frosta, Meråker og Stjørdal. Intensjonene med Værnesregionen er å gi innbyggerne i kommunene bedre tjenester gjennom interkommunalt samarbeid.
description: Værnesregionen er et samarbeid mellom de seks kommunene Tydal, Selbu, Malvik, Frosta, Meråker og Stjørdal. Intensjonene med Værnesregionen er å gi innbyggerne i kommunene bedre tjenester gjennom interkommunalt samarbeid.
status: Gyldig

Saltdal kommune
type: Concept
in scheme: Organisasjoner
top concept of: Organisasjoner
status: Gyldig

Norges orienteringsforbund
type: Concept
in scheme: Organisasjoner
top concept of: Organisasjoner
definition: Norges Orienteringsforbund er en sammenslutning av alle idrettslag som organiserer orienteringsidrett og er medlemmer av Norges idrettsforbund og olympiske og paralympiske komité (NIF). Idrettslagene organiseres i orienteringskretser.
description: Norges Orienteringsforbund er en sammenslutning av alle idrettslag som organiserer orienteringsidrett og er medlemmer av Norges idrettsforbund og olympiske og paralympiske komité (NIF). Idrettslagene organiseres i orienteringskretser.
status: Gyldig

Horten kommune
type: Concept
in scheme: Organisasjoner
top concept of: Organisasjoner
status: Gyldig

Selbu kommune
type: Concept
in scheme: Organisasjoner
top concept of: Organisasjoner
status: Gyldig

Frosta kommune
type: Concept
in scheme: Organisasjoner
top concept of: Organisasjoner
status: Gyldig

Vest-Telemarkrådet
type: Concept
in scheme: Organisasjoner
top concept of: Organisasjoner
definition: Vest-Telemarkrådet er regionalt samarbeidsorgan for kommunane Fyresdal, Kviteseid, Nissedal, Seljord, Tokke og Vinje. Rådet løyser felles spørsmål for dei deltakande kommunane, og står som koordinator for ei rekkje samarbeidstiltak i regionen.
description: Vest-Telemarkrådet er regionalt samarbeidsorgan for kommunane Fyresdal, Kviteseid, Nissedal, Seljord, Tokke og Vinje. Rådet løyser felles spørsmål for dei deltakande kommunane, og står som koordinator for ei rekkje samarbeidstiltak i regionen.
status: Gyldig

Solund kommune
type: Concept
in scheme: Organisasjoner
top concept of: Organisasjoner
status: Gyldig

Frøya kommune
type: Concept
in scheme: Organisasjoner
top concept of: Organisasjoner
status: Gyldig

Gildeskål kommune
type: Concept
in scheme: Organisasjoner
top concept of: Organisasjoner
status: Gyldig

Birkenes kommune
type: Concept
in scheme: Organisasjoner
top concept of: Organisasjoner
status: Gyldig

Sørfold kommune
type: Concept
in scheme: Organisasjoner
top concept of: Organisasjoner
status: Gyldig

Fjaler kommune
type: Concept
in scheme: Organisasjoner
top concept of: Organisasjoner
status: Gyldig

Røst kommune
type: Concept
in scheme: Organisasjoner
top concept of: Organisasjoner
status: Gyldig

Namsos kommune
type: Concept
in scheme: Organisasjoner
top concept of: Organisasjoner
status: Gyldig

Kvinesdal kommune
type: Concept
in scheme: Organisasjoner
top concept of: Organisasjoner
status: Gyldig

Tingvoll kommune
type: Concept
in scheme: Organisasjoner
top concept of: Organisasjoner
status: Gyldig

Innherred samkommune
type: Concept
in scheme: Organisasjoner
top concept of: Organisasjoner
definition: Interkommunalt samarbeid mellom Levanger og Verdal kommuner, Nord-Trøndelag.
description: Interkommunalt samarbeid mellom Levanger og Verdal kommuner, Nord-Trøndelag.
status: Erstattet

Rælingen kommune
type: Concept
in scheme: Organisasjoner
top concept of: Organisasjoner
status: Gyldig

KartIKUS
type: Concept
in scheme: Organisasjoner
top concept of: Organisasjoner
definition: KartIKUS er et samarbeid mellom kommunene Fjell, Fusa og Øygarden.
description: KartIKUS er et samarbeid mellom kommunene Fjell, Fusa og Øygarden.
status: Gyldig

Hamarøy kommune
type: Concept
in scheme: Organisasjoner
top concept of: Organisasjoner
status: Gyldig

Vevelstad kommune
type: Concept
in scheme: Organisasjoner
top concept of: Organisasjoner
status: Gyldig

Ålesund kommune
type: Concept
in scheme: Organisasjoner
top concept of: Organisasjoner
status: Gyldig

Elverum kommune
type: Concept
in scheme: Organisasjoner
top concept of: Organisasjoner
status: Gyldig

Hasvik kommune
type: Concept
in scheme: Organisasjoner
top concept of: Organisasjoner
status: Sendt inn

Statsforvaltaren i Vestland
type: Concept
in scheme: Organisasjoner
top concept of: Organisasjoner
status: Tilbaketrukket

Sør-Odal kommune
type: Concept
in scheme: Organisasjoner
top concept of: Organisasjoner
status: Gyldig

Gjesdal kommune
type: Concept
in scheme: Organisasjoner
top concept of: Organisasjoner
status: Gyldig

Direktoratet for byggkvalitet
type: Concept
in scheme: Organisasjoner
top concept of: Organisasjoner
status: Gyldig

Vegårshei kommune
type: Concept
in scheme: Organisasjoner
top concept of: Organisasjoner
status: Gyldig

Nannestad kommune
type: Concept
in scheme: Organisasjoner
top concept of: Organisasjoner
status: Gyldig

Fedje kommune
type: Concept
in scheme: Organisasjoner
top concept of: Organisasjoner
status: Gyldig

Kongsvinger kommune
type: Concept
in scheme: Organisasjoner
top concept of: Organisasjoner
status: Gyldig

Åseral kommune
type: Concept
in scheme: Organisasjoner
top concept of: Organisasjoner
status: Gyldig

Tokke kommune
type: Concept
in scheme: Organisasjoner
top concept of: Organisasjoner
status: Gyldig

Midtre Gauldal kommune
type: Concept
in scheme: Organisasjoner
top concept of: Organisasjoner
status: Gyldig

Nes kommune
type: Concept
in scheme: Organisasjoner
top concept of: Organisasjoner
status: Gyldig

Sør-Fron kommune
type: Concept
in scheme: Organisasjoner
top concept of: Organisasjoner
status: Gyldig

Hå kommune
type: Concept
in scheme: Organisasjoner
top concept of: Organisasjoner
status: Gyldig

Ørland kommune
type: Concept
in scheme: Organisasjoner
top concept of: Organisasjoner
status: Gyldig

Alvdal kommune
type: Concept
in scheme: Organisasjoner
top concept of: Organisasjoner
status: Gyldig

Øksnes kommune
type: Concept
in scheme: Organisasjoner
top concept of: Organisasjoner
status: Gyldig

Vågå kommune
type: Concept
in scheme: Organisasjoner
top concept of: Organisasjoner
status: Gyldig

Alstahaug kommune
type: Concept
in scheme: Organisasjoner
top concept of: Organisasjoner
status: Gyldig

Longyearbyen lokalstyre
type: Concept
in scheme: Organisasjoner
top concept of: Organisasjoner
status: Gyldig

Bodø kommune
type: Concept
in scheme: Organisasjoner
top concept of: Organisasjoner
status: Gyldig

Telenor
type: Concept
in scheme: Organisasjoner
top concept of: Organisasjoner
definition: Telenor er et norsk teleselskap. Selskapet er i dag et delprivatisert og børsnotert aksjeselskap med selvstendig forretningsvirksomhet.
description: Telenor er et norsk teleselskap. Selskapet er i dag et delprivatisert og børsnotert aksjeselskap med selvstendig forretningsvirksomhet.
status: Gyldig

Lyngen kommune
type: Concept
in scheme: Organisasjoner
top concept of: Organisasjoner
status: Gyldig

Sandefjord kommune
type: Concept
in scheme: Organisasjoner
top concept of: Organisasjoner
status: Gyldig

Hjelmeland kommune
type: Concept
in scheme: Organisasjoner
top concept of: Organisasjoner
status: Gyldig

Sykkylven kommune
type: Concept
in scheme: Organisasjoner
top concept of: Organisasjoner
status: Gyldig

Nordre Follo kommune
type: Concept
in scheme: Organisasjoner
top concept of: Organisasjoner
status: Gyldig

Karmøy kommune
type: Concept
in scheme: Organisasjoner
top concept of: Organisasjoner
status: Gyldig

Miljødirektoratet
type: Concept
in scheme: Organisasjoner
top concept of: Organisasjoner
definition: Miljødirektoratets hovedoppgaver er å redusere klimagassutslipp, forvalte norsk natur og hindre forurensning.
description: Miljødirektoratets hovedoppgaver er å redusere klimagassutslipp, forvalte norsk natur og hindre forurensning.
status: Gyldig

Sømna kommune
type: Concept
in scheme: Organisasjoner
top concept of: Organisasjoner
status: Gyldig

Meråker kommune
type: Concept
in scheme: Organisasjoner
top concept of: Organisasjoner
status: Gyldig

Aukra kommune
type: Concept
in scheme: Organisasjoner
top concept of: Organisasjoner
status: Gyldig

Lillehammer kommune
type: Concept
in scheme: Organisasjoner
top concept of: Organisasjoner
status: Gyldig

Lødingen kommune
type: Concept
in scheme: Organisasjoner
top concept of: Organisasjoner
status: Gyldig

Overhalla kommune
type: Concept
in scheme: Organisasjoner
top concept of: Organisasjoner
status: Gyldig

Lavangen kommune
type: Concept
in scheme: Organisasjoner
top concept of: Organisasjoner
status: Gyldig

Domstoladministrasjonen
type: Concept
in scheme: Organisasjoner
top concept of: Organisasjoner
definition: Domstoladministrasjonen (DA) er den administrative overbygningen for landets domstoler og jordskifteretter.
description: Domstoladministrasjonen (DA) er den administrative overbygningen for landets domstoler og jordskifteretter.
status: Gyldig

Vennesla kommune
type: Concept
in scheme: Organisasjoner
top concept of: Organisasjoner
status: Gyldig

Bardu kommune
type: Concept
in scheme: Organisasjoner
top concept of: Organisasjoner
status: Gyldig

Enebakk kommune
type: Concept
in scheme: Organisasjoner
top concept of: Organisasjoner
status: Gyldig

Norsk institutt for bioøkonomi
type: Concept
in scheme: Organisasjoner
top concept of: Organisasjoner
definition: Norsk institutt for bioøkonomi (NIBIO) ble opprettet 1. juli 2015 som en fusjon av Bioforsk, Norsk institutt for landbruksøkonomisk forskning (NILF) og Norsk institutt for skog og landskap. Instituttet forsker og leverer kunnskap om mat- og planteproduksjon, miljø, kart, arealbruk, genressurser, skog, foretaks-, nærings- og samfunnsøkonomi.
description: Norsk institutt for bioøkonomi (NIBIO) ble opprettet 1. juli 2015 som en fusjon av Bioforsk, Norsk institutt for landbruksøkonomisk forskning (NILF) og Norsk institutt for skog og landskap. Instituttet forsker og leverer kunnskap om mat- og planteproduksjon, miljø, kart, arealbruk, genressurser, skog, foretaks-, nærings- og samfunnsøkonomi.
status: Gyldig

Stad kommune
type: Concept
in scheme: Organisasjoner
top concept of: Organisasjoner
status: Gyldig

Norsk rikskringkasting
type: Concept
in scheme: Organisasjoner
top concept of: Organisasjoner
definition: Statlig almennkringkaster
description: Statlig almennkringkaster
status: Gyldig

Stord kommune
type: Concept
in scheme: Organisasjoner
top concept of: Organisasjoner
status: Gyldig

Vinje kommune
type: Concept
in scheme: Organisasjoner
top concept of: Organisasjoner
status: Gyldig

Bane NOR SF
type: Concept
in scheme: Organisasjoner
top concept of: Organisasjoner
definition: Bane NOR er et statlig foretak med ansvar for den nasjonale jernbaneinfrastrukturen.
description: Bane NOR er et statlig foretak med ansvar for den nasjonale jernbaneinfrastrukturen.
status: Gyldig

Listerkart
type: Concept
in scheme: Organisasjoner
top concept of: Organisasjoner
definition: Listerkart er et samarbeid mellom kommunene Farsund, Flekkefjord, Kvinesdal, Lyngdal og Sirdal.
description: Listerkart er et samarbeid mellom kommunene Farsund, Flekkefjord, Kvinesdal, Lyngdal og Sirdal.
status: Gyldig

Gjemnes kommune
type: Concept
in scheme: Organisasjoner
top concept of: Organisasjoner
status: Gyldig

Kristiansund kommune
type: Concept
in scheme: Organisasjoner
top concept of: Organisasjoner
status: Gyldig

Finnmarkseiendommen
type: Concept
in scheme: Organisasjoner
top concept of: Organisasjoner
definition: FeFo er et eget rettssubjekt i Finnmark som forvalter grunn og naturressurser mv. som den eier i samsvar med Finnmarkslovens formål og reglene i loven.
description: FeFo er et eget rettssubjekt i Finnmark som forvalter grunn og naturressurser mv. som den eier i samsvar med Finnmarkslovens formål og reglene i loven.
status: Gyldig

Moss kommune
type: Concept
in scheme: Organisasjoner
top concept of: Organisasjoner
status: Gyldig

Seljord kommune
type: Concept
in scheme: Organisasjoner
top concept of: Organisasjoner
status: Gyldig

Etnedal kommune
type: Concept
in scheme: Organisasjoner
top concept of: Organisasjoner
status: Gyldig

Åsnes kommune
type: Concept
in scheme: Organisasjoner
top concept of: Organisasjoner
status: Gyldig

Høylandet kommune
type: Concept
in scheme: Organisasjoner
top concept of: Organisasjoner
status: Gyldig

Rollag kommune
type: Concept
in scheme: Organisasjoner
top concept of: Organisasjoner
status: Gyldig

Lindesnes kommune
type: Concept
in scheme: Organisasjoner
top concept of: Organisasjoner
status: Gyldig

Snåsa kommune
type: Concept
in scheme: Organisasjoner
top concept of: Organisasjoner
status: Gyldig

Halden kommune
type: Concept
in scheme: Organisasjoner
top concept of: Organisasjoner
status: Gyldig

Lesja kommune
type: Concept
in scheme: Organisasjoner
top concept of: Organisasjoner
status: Gyldig

Gol kommune
type: Concept
in scheme: Organisasjoner
top concept of: Organisasjoner
status: Gyldig

Fylkeskommunene
type: Concept
in scheme: Organisasjoner
top concept of: Organisasjoner
definition: Norske fylkeskommuner
description: Norske fylkeskommuner
status: Gyldig

Geovekst
type: Concept
in scheme: Organisasjoner
top concept of: Organisasjoner
definition: Geovekst er et samarbeid om felles etablering, forvaltning, drift, vedlikehold og bruk av geografisk informasjon. Samarbeidet består av Statens vegvesen, Energi Norge ,KS (kommunesektorens organisasjon), Kartverket, Telenor, Landbruksdepartementet med underliggende etater og Norges vassdrags- og energidirektorat
description: Geovekst er et samarbeid om felles etablering, forvaltning, drift, vedlikehold og bruk av geografisk informasjon. Samarbeidet består av Statens vegvesen, Energi Norge ,KS (kommunesektorens organisasjon), Kartverket, Telenor, Landbruksdepartementet med underliggende etater og Norges vassdrags- og energidirektorat
status: Gyldig

Sande kommune
type: Concept
in scheme: Organisasjoner
top concept of: Organisasjoner
status: Gyldig

Haram kommune
type: Concept
in scheme: Organisasjoner
top concept of: Organisasjoner
status: Gyldig

Sør-Aurdal kommune
type: Concept
in scheme: Organisasjoner
top concept of: Organisasjoner
status: Gyldig

Hol kommune
type: Concept
in scheme: Organisasjoner
top concept of: Organisasjoner
status: Gyldig

Gamvik kommune
type: Concept
in scheme: Organisasjoner
top concept of: Organisasjoner
status: Gyldig

Vang kommune
type: Concept
in scheme: Organisasjoner
top concept of: Organisasjoner
status: Gyldig

Norsk institutt for naturforskning
type: Concept
in scheme: Organisasjoner
top concept of: Organisasjoner
definition: Norsk institutt for naturforskning (NINA) er en uavhengig stiftelse som forsker på natur og samspillet natur – samfunn. NINAs oppdragsgivere er Forskningsrådet, EU, offentlig forvaltning og næringsliv.
description: Norsk institutt for naturforskning (NINA) er en uavhengig stiftelse som forsker på natur og samspillet natur – samfunn. NINAs oppdragsgivere er Forskningsrådet, EU, offentlig forvaltning og næringsliv.
status: Gyldig

Direktoratet for forvaltning og ikt
type: Concept
in scheme: Organisasjoner
top concept of: Organisasjoner
definition: Difi skal bidra til å gjøre offentleg sektor mer innovativ og har fått i oppdrag å etablere et kompetansemiljø for innovasjon i stat og kommune. Difi ble lagt ned 31.12.2019 og fra 01.01.2020 har Digitaliseringsdirektoratet ivaretatt oppgavene.
description: Difi skal bidra til å gjøre offentleg sektor mer innovativ og har fått i oppdrag å etablere et kompetansemiljø for innovasjon i stat og kommune. Difi ble lagt ned 31.12.2019 og fra 01.01.2020 har Digitaliseringsdirektoratet ivaretatt oppgavene.
status: Erstattet

Nittedal kommune
type: Concept
in scheme: Organisasjoner
top concept of: Organisasjoner
status: Gyldig

Direktoratet for strålevern og atomsikkerhet
type: Concept
in scheme: Organisasjoner
top concept of: Organisasjoner
definition: Direktoratet for strålevern og atomsikkerhet, DSA, er fag- og forvaltningsmyndighet på området strålevern, atomsikkerhet og ikke-spredning, radioaktiv forurensning og radioaktivt avfall. Vi utfører oppgaver på vegne av Helse- og omsorgsdepartementet, Utenriksdepartementet og Klima- og miljødepartementet.
description: Direktoratet for strålevern og atomsikkerhet, DSA, er fag- og forvaltningsmyndighet på området strålevern, atomsikkerhet og ikke-spredning, radioaktiv forurensning og radioaktivt avfall. Vi utfører oppgaver på vegne av Helse- og omsorgsdepartementet, Utenriksdepartementet og Klima- og miljødepartementet.
status: Gyldig

Statsforvalteren
type: Concept
in scheme: Organisasjoner
top concept of: Organisasjoner
definition: Statsforvalteren er statens representant i fylket. Statsforvalteren har viktige styrings- og rettledningsoppgaver overfor kommunene og skal føre tilsyn med den kommunale forvaltningen og den kommunale økonomien. Statsforvalteren er også statlig sektormyndighet på viktige områder som miljøvern, landbruk, sivil beredskap, sosial omsorg, og innenfor familiesektoren
description: Statsforvalteren er statens representant i fylket. Statsforvalteren har viktige styrings- og rettledningsoppgaver overfor kommunene og skal føre tilsyn med den kommunale forvaltningen og den kommunale økonomien. Statsforvalteren er også statlig sektormyndighet på viktige områder som miljøvern, landbruk, sivil beredskap, sosial omsorg, og innenfor familiesektoren
status: Gyldig

Statistisk sentralbyrå
type: Concept
in scheme: Organisasjoner
top concept of: Organisasjoner
definition: Statistisk sentralbyrå (SSB) har hovedansvaret for offisiell statistikk i Norge og har også en omfattende forsknings- og analysevirksomhet.
description: Statistisk sentralbyrå (SSB) har hovedansvaret for offisiell statistikk i Norge og har også en omfattende forsknings- og analysevirksomhet.
status: Gyldig

Ullensaker kommune
type: Concept
in scheme: Organisasjoner
top concept of: Organisasjoner
status: Gyldig

Hammerfest kommune
type: Concept
in scheme: Organisasjoner
top concept of: Organisasjoner
status: Gyldig

Arendal kommune
type: Concept
in scheme: Organisasjoner
top concept of: Organisasjoner
status: Gyldig

Statkraft
type: Concept
in scheme: Organisasjoner
top concept of: Organisasjoner
definition: Statkraft er et ledende selskap innen vannkraft internasjonalt og Europas største produsent av fornybar kraft. Konsernet produserer vannkraft, vindkraft, gasskraft og fjernvarme, og er en global markedsaktør innen energihandel. - See more at: http://www.statkraft.no/om-statkraft/#sthash.EfPtxFmD.dpuf
description: Statkraft er et ledende selskap innen vannkraft internasjonalt og Europas største produsent av fornybar kraft. Konsernet produserer vannkraft, vindkraft, gasskraft og fjernvarme, og er en global markedsaktør innen energihandel. - See more at: http://www.statkraft.no/om-statkraft/#sthash.EfPtxFmD.dpuf
status: Gyldig

Nord-Aurdal kommune
type: Concept
in scheme: Organisasjoner
top concept of: Organisasjoner
status: Gyldig

Statsbygg
type: Concept
in scheme: Organisasjoner
top concept of: Organisasjoner
definition: Statsbygg er en statlig forvaltningsbedrift under Kommunal- og moderniseringsdepartementet som skal iverksette og gjennomføre Stortingets vedtatte politikk innen statlig bygge- og eiendomssektor og tilby kostnadseffektive og funksjonelle lokaler til statlige virksomheter.
description: Statsbygg er en statlig forvaltningsbedrift under Kommunal- og moderniseringsdepartementet som skal iverksette og gjennomføre Stortingets vedtatte politikk innen statlig bygge- og eiendomssektor og tilby kostnadseffektive og funksjonelle lokaler til statlige virksomheter.
status: Gyldig

Fitjar kommune
type: Concept
in scheme: Organisasjoner
top concept of: Organisasjoner
status: Gyldig

Kåfjord kommune / Gaivuona suohkan
type: Concept
in scheme: Organisasjoner
top concept of: Organisasjoner
status: Gyldig

Temadata innlandet
type: Concept
in scheme: Organisasjoner
top concept of: Organisasjoner
status: Sendt inn

Hustadvika kommune
type: Concept
in scheme: Organisasjoner
top concept of: Organisasjoner
status: Gyldig

Bærum kommune
type: Concept
in scheme: Organisasjoner
top concept of: Organisasjoner
status: Gyldig

Stor-Elvdal kommune
type: Concept
in scheme: Organisasjoner
top concept of: Organisasjoner
status: Gyldig

Norsk Romsenter
type: Concept
in scheme: Organisasjoner
top concept of: Organisasjoner
definition: Norsk Romsenter er en etat under Nærings- og fiskeridepartementet og ble opprettet i 1987 da Norge ble med i ESA (European Space Agency).
description: Norsk Romsenter er en etat under Nærings- og fiskeridepartementet og ble opprettet i 1987 da Norge ble med i ESA (European Space Agency).
status: Gyldig

Vaksdal kommune
type: Concept
in scheme: Organisasjoner
top concept of: Organisasjoner
status: Gyldig

Norges vassdrags- og energidirektorat
type: Concept
in scheme: Organisasjoner
top concept of: Organisasjoner
definition: Noregs vassdrags- og energidirektorat (NVE) har ansvar for å forvalte Noregs vatn- og energiressursar. NVE varetek også dei statlege forvaltningsoppgåvene innan skredførebygging.
description: Noregs vassdrags- og energidirektorat (NVE) har ansvar for å forvalte Noregs vatn- og energiressursar. NVE varetek også dei statlege forvaltningsoppgåvene innan skredførebygging.
status: Gyldig

Sør-Varanger kommune
type: Concept
in scheme: Organisasjoner
top concept of: Organisasjoner
status: Gyldig

Smøla kommune
type: Concept
in scheme: Organisasjoner
top concept of: Organisasjoner
status: Gyldig

Gausdal kommune
type: Concept
in scheme: Organisasjoner
top concept of: Organisasjoner
status: Gyldig

NORCE Norwegian Research Centre
type: Concept
in scheme: Organisasjoner
top concept of: Organisasjoner
status: Gyldig

Krødsherad kommune
type: Concept
in scheme: Organisasjoner
top concept of: Organisasjoner
status: Gyldig

Universitetssenteret på Svalbard
type: Concept
in scheme: Organisasjoner
top concept of: Organisasjoner
status: Sendt inn

Gratangen kommune
type: Concept
in scheme: Organisasjoner
top concept of: Organisasjoner
status: Gyldig

Lund kommune
type: Concept
in scheme: Organisasjoner
top concept of: Organisasjoner
status: Gyldig

Samnanger kommune
type: Concept
in scheme: Organisasjoner
top concept of: Organisasjoner
status: Gyldig

Brønnøy kommune
type: Concept
in scheme: Organisasjoner
top concept of: Organisasjoner
status: Gyldig

Kinn kommune
type: Concept
in scheme: Organisasjoner
top concept of: Organisasjoner
status: Gyldig

Nordre Øyeren Fuglestasjon
type: Concept
in scheme: Organisasjoner
top concept of: Organisasjoner
definition: Nordre Øyeren Fuglestasjon (NØF) ble formelt etablert i 1973 og har siden det fokusert på registrering av vanntilknyttet fugl (svaner, gjess, ender og vadere). Våre ukentlige vann- fuglregistreringer foregår i den isfrie delen av året og er et samarbeid mellom NØF, Miljø- direktoratet og Statsforvalteren i Oslo og Viken
description: Nordre Øyeren Fuglestasjon (NØF) ble formelt etablert i 1973 og har siden det fokusert på registrering av vanntilknyttet fugl (svaner, gjess, ender og vadere). Våre ukentlige vann- fuglregistreringer foregår i den isfrie delen av året og er et samarbeid mellom NØF, Miljø- direktoratet og Statsforvalteren i Oslo og Viken
status: Sendt inn

Meteorologisk institutt
type: Concept
in scheme: Organisasjoner
top concept of: Organisasjoner
definition: Meteorologisk institutt varslar vêret, overvakar klimaet og driv forsking.
description: Meteorologisk institutt varslar vêret, overvakar klimaet og driv forsking.
status: Gyldig

Kvæfjord kommune
type: Concept
in scheme: Organisasjoner
top concept of: Organisasjoner
status: Gyldig

Indre Østfold kommune
type: Concept
in scheme: Organisasjoner
top concept of: Organisasjoner
status: Gyldig

Sortland kommune
type: Concept
in scheme: Organisasjoner
top concept of: Organisasjoner
status: Gyldig

Inderøy kommune
type: Concept
in scheme: Organisasjoner
top concept of: Organisasjoner
status: Gyldig

Orkland kommune
type: Concept
in scheme: Organisasjoner
top concept of: Organisasjoner
status: Gyldig

Karasjoga gielda / Karasjok kommune
type: Concept
in scheme: Organisasjoner
top concept of: Organisasjoner
status: Gyldig

Gjerstad kommune
type: Concept
in scheme: Organisasjoner
top concept of: Organisasjoner
status: Gyldig

Bjørnafjorden kommune
type: Concept
in scheme: Organisasjoner
top concept of: Organisasjoner
status: Gyldig

Senter mot marin forsøpling
type: Concept
in scheme: Organisasjoner
top concept of: Organisasjoner
definition: Statlig forvaltningsorgan under Klima- og miljødepartementet. Vårt overordnede mål er et renere hav gjennom redusert marin forsøpling.
description: Statlig forvaltningsorgan under Klima- og miljødepartementet. Vårt overordnede mål er et renere hav gjennom redusert marin forsøpling.
status: Gyldig

QGIS Norge
type: Concept
in scheme: Organisasjoner
top concept of: Organisasjoner
status: Gyldig

Haugesund kommune
type: Concept
in scheme: Organisasjoner
top concept of: Organisasjoner
status: Gyldig

Vestre Slidre kommune
type: Concept
in scheme: Organisasjoner
top concept of: Organisasjoner
status: Gyldig

Sørreisa kommune
type: Concept
in scheme: Organisasjoner
top concept of: Organisasjoner
status: Gyldig

Utdanningsdirektoratet
type: Concept
in scheme: Organisasjoner
top concept of: Organisasjoner
definition: Utdanningsdirektoratet har ansvaret for utviklingen av barnehage, grunnskole og videregående opplæring.
description: Utdanningsdirektoratet har ansvaret for utviklingen av barnehage, grunnskole og videregående opplæring.
status: Gyldig

Sokkeldirektoratet
type: Concept
in scheme: Organisasjoner
top concept of: Organisasjoner
definition: Sokkeldirektoratet skal bidra til størst mulig verdiskaping for samfunnet gjennom god og forsvarlig forvaltning av petroleumsressursene på norsk kontinentalsokkel. Direktoratet har også oppgaver i forvaltningen av CO2-lagring, havbunnsmineraler samt havbunnsdata knyttet til installasjon av vindturbiner til havs. Direktoratet deler og holder oversikt over data fra kontinentalsokkelen
description: Sokkeldirektoratet skal bidra til størst mulig verdiskaping for samfunnet gjennom god og forsvarlig forvaltning av petroleumsressursene på norsk kontinentalsokkel. Direktoratet har også oppgaver i forvaltningen av CO2-lagring, havbunnsmineraler samt havbunnsdata knyttet til installasjon av vindturbiner til havs. Direktoratet deler og holder oversikt over data fra kontinentalsokkelen
status: Gyldig

Notodden kommune
type: Concept
in scheme: Organisasjoner
top concept of: Organisasjoner
status: Gyldig

Stiftelsen Nansen senter for miljø og fjernmåling
type: Concept
in scheme: Organisasjoner
top concept of: Organisasjoner
status: Gyldig

Målselv kommune
type: Concept
in scheme: Organisasjoner
top concept of: Organisasjoner
status: Gyldig

Vest-Finnmark regionråd
type: Concept
in scheme: Organisasjoner
top concept of: Organisasjoner
definition: Vest-Finnmark regionråd er en strategisk allianse, basert på Kommuneloven §27, mellom kommunene Hammerfest, Alta, Loppa, Hasvik, Kvalsund, Måsøy og Nordkapp. Formålet er å skape samarbeid om næringsutvikling, utvikling av offentlige tjenestetilbud, samt politisk påvirkning.
description: Vest-Finnmark regionråd er en strategisk allianse, basert på Kommuneloven §27, mellom kommunene Hammerfest, Alta, Loppa, Hasvik, Kvalsund, Måsøy og Nordkapp. Formålet er å skape samarbeid om næringsutvikling, utvikling av offentlige tjenestetilbud, samt politisk påvirkning.
status: Gyldig

Austevoll kommune
type: Concept
in scheme: Organisasjoner
top concept of: Organisasjoner
status: Gyldig

Norsk Polarinstitutt
type: Concept
in scheme: Organisasjoner
top concept of: Organisasjoner
definition: Norges sentrale institutt for vitenskapelig forskning, miljøovervåking og kartlegging av Arktis og Antarktis. Instituttet er kunnskapsleverandør og rådgiver for norske myndigheter i polarområdene og har forvaltningsmyndighet for all norsk aktivitet i Antarktis
description: Norges sentrale institutt for vitenskapelig forskning, miljøovervåking og kartlegging av Arktis og Antarktis. Instituttet er kunnskapsleverandør og rådgiver for norske myndigheter i polarområdene og har forvaltningsmyndighet for all norsk aktivitet i Antarktis
status: Gyldig

Vefsn kommune
type: Concept
in scheme: Organisasjoner
top concept of: Organisasjoner
status: Gyldig

Riksantikvaren
type: Concept
in scheme: Organisasjoner
top concept of: Organisasjoner
definition: Riksantikvaren er direktorat for kulturminneforvaltning og faglig rådgiver for Klima- og miljødepartementet i utviklingen av den statlige kulturminnepolitikken.
description: Riksantikvaren er direktorat for kulturminneforvaltning og faglig rådgiver for Klima- og miljødepartementet i utviklingen av den statlige kulturminnepolitikken.
status: Gyldig

Hadeland
type: Concept
in scheme: Organisasjoner
top concept of: Organisasjoner
definition: Kartsamarbeidet Hadeland er et samarbeid mellom kommunene Gran, Jevnaker og Lunner.
description: Kartsamarbeidet Hadeland er et samarbeid mellom kommunene Gran, Jevnaker og Lunner.
status: Gyldig

Rindal kommune
type: Concept
in scheme: Organisasjoner
top concept of: Organisasjoner
status: Gyldig

Åfjord kommune
type: Concept
in scheme: Organisasjoner
top concept of: Organisasjoner
status: Gyldig

Os kommune
type: Concept
in scheme: Organisasjoner
top concept of: Organisasjoner
status: Gyldig

Barne- og familiedepartementet
type: Concept
in scheme: Organisasjoner
top concept of: Organisasjoner
definition: Barne- og familiedepartementet (BFD) har ansvar for barn og unges oppvekst- og levekår, familie og samliv, tro og livssyn og forbrukerpolitikk.
description: Barne- og familiedepartementet (BFD) har ansvar for barn og unges oppvekst- og levekår, familie og samliv, tro og livssyn og forbrukerpolitikk.
status: Gyldig

GLO-kart
type: Concept
in scheme: Organisasjoner
top concept of: Organisasjoner
definition: Kartsamarbeid mellom kommunene Gausdal, Lillehammer og Øyer.
description: Kartsamarbeid mellom kommunene Gausdal, Lillehammer og Øyer.
status: Gyldig

Lierne kommune
type: Concept
in scheme: Organisasjoner
top concept of: Organisasjoner
status: Gyldig

Stjørdal kommune
type: Concept
in scheme: Organisasjoner
top concept of: Organisasjoner
status: Gyldig

Steigen kommune
type: Concept
in scheme: Organisasjoner
top concept of: Organisasjoner
status: Gyldig

Norsk institutt for kulturminneforskning
type: Concept
in scheme: Organisasjoner
top concept of: Organisasjoner
definition: Norsk institutt for kulturminneforskning er et uavhengig forsknings- og kompetansemiljø for norske og internasjonale kulturminner.
description: Norsk institutt for kulturminneforskning er et uavhengig forsknings- og kompetansemiljø for norske og internasjonale kulturminner.
status: Gyldig

Måsøy kommune
type: Concept
in scheme: Organisasjoner
top concept of: Organisasjoner
status: Gyldig

Forsvarets forskningsinstitutt
type: Concept
in scheme: Organisasjoner
top concept of: Organisasjoner
status: Sendt inn

Sandnes kommune
type: Concept
in scheme: Organisasjoner
top concept of: Organisasjoner
status: Gyldig

Porsanger kommune
type: Concept
in scheme: Organisasjoner
top concept of: Organisasjoner
status: Gyldig

Moskenes kommune
type: Concept
in scheme: Organisasjoner
top concept of: Organisasjoner
status: Gyldig

Barentswatch
type: Concept
in scheme: Organisasjoner
top concept of: Organisasjoner
status: Gyldig

Siljan kommune
type: Concept
in scheme: Organisasjoner
top concept of: Organisasjoner
status: Gyldig

Herøy kommune - Møre og Romsdal
type: Concept
in scheme: Organisasjoner
top concept of: Organisasjoner
status: Gyldig

Nasjonal sikkerhetsmyndighet
type: Concept
in scheme: Organisasjoner
top concept of: Organisasjoner
status: Gyldig

Trysil kommune
type: Concept
in scheme: Organisasjoner
top concept of: Organisasjoner
status: Gyldig

Luster kommune
type: Concept
in scheme: Organisasjoner
top concept of: Organisasjoner
status: Gyldig

Tydal kommune
type: Concept
in scheme: Organisasjoner
top concept of: Organisasjoner
status: Gyldig

Skien kommune
type: Concept
in scheme: Organisasjoner
top concept of: Organisasjoner
status: Gyldig

Bømlo kommune
type: Concept
in scheme: Organisasjoner
top concept of: Organisasjoner
status: Gyldig

Midt-Telemark
type: Concept
in scheme: Organisasjoner
top concept of: Organisasjoner
definition: Midt-Telemark er et samarbeid mellom kommunene Bø, Nome og Sauherad.
description: Midt-Telemark er et samarbeid mellom kommunene Bø, Nome og Sauherad.
status: Gyldig

Dønna kommune
type: Concept
in scheme: Organisasjoner
top concept of: Organisasjoner
status: Gyldig

Lærdal kommune
type: Concept
in scheme: Organisasjoner
top concept of: Organisasjoner
status: Gyldig

Regionale helseforetak
type: Concept
in scheme: Organisasjoner
top concept of: Organisasjoner
definition: Norge er delt i fire helseregioner. I hver av dem har et regionalt helseforetak ansvar for å sørge for at befolkningen blir tilbudt spesialiserte helsetjenester
description: Norge er delt i fire helseregioner. I hver av dem har et regionalt helseforetak ansvar for å sørge for at befolkningen blir tilbudt spesialiserte helsetjenester
status: Gyldig

Flakstad kommune
type: Concept
in scheme: Organisasjoner
top concept of: Organisasjoner
status: Gyldig

Tvedestrand kommune
type: Concept
in scheme: Organisasjoner
top concept of: Organisasjoner
status: Gyldig

Lillesand kommune
type: Concept
in scheme: Organisasjoner
top concept of: Organisasjoner
status: Gyldig

Sunnfjord kommune
type: Concept
in scheme: Organisasjoner
top concept of: Organisasjoner
status: Gyldig

Landbruksdirektoratet
type: Concept
in scheme: Organisasjoner
top concept of: Organisasjoner
definition: Landbruksdirektoratet set landbruks- og matpolitikken ut i livet og er eit støtte- og utgreiingsorgan for LMD
description: Landbruksdirektoratet set landbruks- og matpolitikken ut i livet og er eit støtte- og utgreiingsorgan for LMD
status: Gyldig

Steinkjer kommune
type: Concept
in scheme: Organisasjoner
top concept of: Organisasjoner
status: Gyldig

Norsk Vann BA
type: Concept
in scheme: Organisasjoner
top concept of: Organisasjoner
status: Gyldig

Midtre Namdalsregionen
type: Concept
in scheme: Organisasjoner
top concept of: Organisasjoner
definition: Midtre Namdalsregionen er et samarbeid mellom kommunene Flatanger, Fosnes, Namdalseid, Namsos og Overhalla.
description: Midtre Namdalsregionen er et samarbeid mellom kommunene Flatanger, Fosnes, Namdalseid, Namsos og Overhalla.
status: Gyldig

Sula kommune
type: Concept
in scheme: Organisasjoner
top concept of: Organisasjoner
status: Gyldig

Veterinærinstituttet
type: Concept
in scheme: Organisasjoner
top concept of: Organisasjoner
definition: Veterinærinstituttet er et biomedisinsk forskningsinstitutt med dyrehelse, fiskehelse og mattrygghet som kjerneområder.
description: Veterinærinstituttet er et biomedisinsk forskningsinstitutt med dyrehelse, fiskehelse og mattrygghet som kjerneområder.
status: Gyldig

Skjervøy kommune
type: Concept
in scheme: Organisasjoner
top concept of: Organisasjoner
status: Gyldig

Nye Veier
type: Concept
in scheme: Organisasjoner
top concept of: Organisasjoner
definition: Selskapets oppgaver omfatter å planlegge, bygge, drifte og vedlikeholde viktige hovedveier som binder landet vårt sammen og knytter Norge til hovedveier i utlandet.
description: Selskapets oppgaver omfatter å planlegge, bygge, drifte og vedlikeholde viktige hovedveier som binder landet vårt sammen og knytter Norge til hovedveier i utlandet.
status: Gyldig

Volda kommune
type: Concept
in scheme: Organisasjoner
top concept of: Organisasjoner
status: Gyldig

Marker kommune
type: Concept
in scheme: Organisasjoner
top concept of: Organisasjoner
status: Gyldig

Hareid kommune
type: Concept
in scheme: Organisasjoner
top concept of: Organisasjoner
status: Gyldig

Bindal kommune
type: Concept
in scheme: Organisasjoner
top concept of: Organisasjoner
status: Gyldig

Geodatasamarbeidet i Nord-Østerdal
type: Concept
in scheme: Organisasjoner
top concept of: Organisasjoner
definition: Kommunene i Nord-Østerdal og Nord-Østerdal kraftlag samarbeider om bruk og utvikling av kartløsninger for publikum og til intern bruk.
description: Kommunene i Nord-Østerdal og Nord-Østerdal kraftlag samarbeider om bruk og utvikling av kartløsninger for publikum og til intern bruk.
status: Gyldig

Fjordakart
type: Concept
in scheme: Organisasjoner
top concept of: Organisasjoner
definition: Fjordakart er et samarbeid mellom kommunene Askvoll, Fjaler, Førde, Gaular, Hyllestad, Høyanger, Jølster, Naustdal og Solund.
description: Fjordakart er et samarbeid mellom kommunene Askvoll, Fjaler, Førde, Gaular, Hyllestad, Høyanger, Jølster, Naustdal og Solund.
status: Gyldig

Sokndal kommune
type: Concept
in scheme: Organisasjoner
top concept of: Organisasjoner
status: Gyldig

Nord-Odal kommune
type: Concept
in scheme: Organisasjoner
top concept of: Organisasjoner
status: Gyldig

Jevnaker kommune
type: Concept
in scheme: Organisasjoner
top concept of: Organisasjoner
status: Gyldig

Midt-Troms
type: Concept
in scheme: Organisasjoner
top concept of: Organisasjoner
definition: Kartsamarbeidet i Midt-Troms er et samarbeid mellom kommunene Balsfjord, Bardu, Dyrøy, Lenvik og Målselv.
description: Kartsamarbeidet i Midt-Troms er et samarbeid mellom kommunene Balsfjord, Bardu, Dyrøy, Lenvik og Målselv.
status: Gyldig

Loppa kommune
type: Concept
in scheme: Organisasjoner
top concept of: Organisasjoner
status: Gyldig

Levanger kommune
type: Concept
in scheme: Organisasjoner
top concept of: Organisasjoner
status: Gyldig

Frogn kommune
type: Concept
in scheme: Organisasjoner
top concept of: Organisasjoner
status: Gyldig

Tysvær kommune
type: Concept
in scheme: Organisasjoner
top concept of: Organisasjoner
status: Gyldig

Rendalen kommune
type: Concept
in scheme: Organisasjoner
top concept of: Organisasjoner
status: Gyldig

Gulen kommune
type: Concept
in scheme: Organisasjoner
top concept of: Organisasjoner
status: Gyldig

Nord universitet
type: Concept
in scheme: Organisasjoner
top concept of: Organisasjoner
status: Gyldig

Vestvågøy kommune
type: Concept
in scheme: Organisasjoner
top concept of: Organisasjoner
status: Gyldig

Froland kommune
type: Concept
in scheme: Organisasjoner
top concept of: Organisasjoner
status: Gyldig

Statnett
type: Concept
in scheme: Organisasjoner
top concept of: Organisasjoner
definition: Statnett er systemansvarlig i det norske kraftsystemet. Statnett er et statsforetak opprettet i henhold til Statsforetaksloven og eid av staten ved Olje- og energidepartementet.
description: Statnett er systemansvarlig i det norske kraftsystemet. Statnett er et statsforetak opprettet i henhold til Statsforetaksloven og eid av staten ved Olje- og energidepartementet.
status: Gyldig

Stiftelsen NILU
type: Concept
in scheme: Organisasjoner
top concept of: Organisasjoner
definition: Klima- og miljøinstituttet NILU er en non-profit stiftelse. NILU skal være et forskningsinstitutt med høy faglig kvalitet og relevant kompetanse på kjerneområdene atmosfærens sammensetning, klimaendringer, luftkvalitet, miljøgifter, helseeffekter, bærekraftige systemer, sirkulær økonomi og digitalisering.
description: Klima- og miljøinstituttet NILU er en non-profit stiftelse. NILU skal være et forskningsinstitutt med høy faglig kvalitet og relevant kompetanse på kjerneområdene atmosfærens sammensetning, klimaendringer, luftkvalitet, miljøgifter, helseeffekter, bærekraftige systemer, sirkulær økonomi og digitalisering.
status: Gyldig

Forsvarsbygg
type: Concept
in scheme: Organisasjoner
top concept of: Organisasjoner
definition: Er en profesjonell, offentlig eiendomsaktør, som bygger, drifter og selger eiendom for Forsvaret.
description: Er en profesjonell, offentlig eiendomsaktør, som bygger, drifter og selger eiendom for Forsvaret.
status: Gyldig

Vestnes kommune
type: Concept
in scheme: Organisasjoner
top concept of: Organisasjoner
status: Gyldig

Artsdatabanken
type: Concept
in scheme: Organisasjoner
top concept of: Organisasjoner
definition: Artsdatabanken er en nasjonal kunnskapsbank for naturmangfold.
description: Artsdatabanken er en nasjonal kunnskapsbank for naturmangfold.
status: Gyldig

Hattfjelldal kommune
type: Concept
in scheme: Organisasjoner
top concept of: Organisasjoner
status: Gyldig