FAIR-register
type: ConceptScheme
description: Register som viser FAIR-status for alle DOK-data, Mareano-data og Marine grunnkart-data

Vannmasser - Havstrøm
type: Concept
in scheme: FAIR-register
top concept of: FAIR-register
definition: Datasettserien er en del av marine grunnkart i kystsonen. Datasett i serien er tilgjengelig for nedlasting.
description: Datasettserien er en del av marine grunnkart i kystsonen. Datasett i serien er tilgjengelig for nedlasting.
status: Sendt inn

Sårbare marine biotoper – modellert utbredelse Svampsamfunn
type: Concept
in scheme: FAIR-register
top concept of: FAIR-register
definition: Modellert utbredelse av sårbare marine biotoper basert på mengdefordeling fra observasjoner på MAREANO tokt og miljødata fra andre kilder. Biotopene er karakterisert av skjøre organismer som lett knuses ved fysisk påvirkning av havbunnen. Kartene viser områder hvor vi kan forvente å finne slike naturtyper basert på resultater fra matematiske modeller. Verdi-enheten er n/100m2. Datasettet viser forekomsten av Svampsamfunn og er definert som en sårbar biotop av Havforskningsinstituttet. Datasettet er basert på videoanalyse og dekker havområder der kartleggingsprogrammet MAREANO har samlet inn videomateriale.
description: Modellert utbredelse av sårbare marine biotoper basert på mengdefordeling fra observasjoner på MAREANO tokt og miljødata fra andre kilder. Biotopene er karakterisert av skjøre organismer som lett knuses ved fysisk påvirkning av havbunnen. Kartene viser områder hvor vi kan forvente å finne slike naturtyper basert på resultater fra matematiske modeller. Verdi-enheten er n/100m2. Datasettet viser forekomsten av Svampsamfunn og er definert som en sårbar biotop av Havforskningsinstituttet. Datasettet er basert på videoanalyse og dekker havområder der kartleggingsprogrammet MAREANO har samlet inn videomateriale.
status: Sendt inn

Trålspor
type: Concept
in scheme: FAIR-register
top concept of: FAIR-register
definition: Antall trålspor observert på havbunnen pr. 100 meter på videostasjoner fra Mareano-toktene. Datasettet er basert på videoobservasjoner og dekker områder der kartleggingsprosjektet MAREANO har samlet inn videomateriale. Datasettet er basert på tolkning av videomateriale av overflaten av havbunnen, samlet inn ved hjelp av videorigg. Opptak av havbunnens overflate ble gjort langs 200 m og 700 m lange transekt. Alle observerte trålspor ble registrert langs hvert transekt. Variabelen ‘trålspor’ er numerisk. Hvert punktsymbol er plottet på koordinatene for transektets midtpunkt, hvor symbolets størrelse korresponderer med antall trålspor.
description: Antall trålspor observert på havbunnen pr. 100 meter på videostasjoner fra Mareano-toktene. Datasettet er basert på videoobservasjoner og dekker områder der kartleggingsprosjektet MAREANO har samlet inn videomateriale. Datasettet er basert på tolkning av videomateriale av overflaten av havbunnen, samlet inn ved hjelp av videorigg. Opptak av havbunnens overflate ble gjort langs 200 m og 700 m lange transekt. Alle observerte trålspor ble registrert langs hvert transekt. Variabelen ‘trålspor’ er numerisk. Hvert punktsymbol er plottet på koordinatene for transektets midtpunkt, hvor symbolets størrelse korresponderer med antall trålspor.
status: Sendt inn

NiN grunntyper og hovedtyper av saltvannssjøbunn, predikert
type: Concept
in scheme: FAIR-register
top concept of: FAIR-register
definition: Datasettet viser den modellerte, romlige fordelingen av observerte NiN grunntyper, og dekker foreløpig Marine Grunnkart-prosjektets pilotområder i Nye Stavanger kommune, Giske og Ålesund. Datasettet er modellert og predikert i rom ved hjelp av random forest, en statistisk maskinlæringsteknikk. Observasjonene er basert på 472 videolinjer som hver er 50 meter lange.
description: Datasettet viser den modellerte, romlige fordelingen av observerte NiN grunntyper, og dekker foreløpig Marine Grunnkart-prosjektets pilotområder i Nye Stavanger kommune, Giske og Ålesund. Datasettet er modellert og predikert i rom ved hjelp av random forest, en statistisk maskinlæringsteknikk. Observasjonene er basert på 472 videolinjer som hver er 50 meter lange.
status: Sendt inn

Sårbare marine biotoper – modellert utbredelse Hardbunnskorallskog
type: Concept
in scheme: FAIR-register
top concept of: FAIR-register
definition: Modellert utbredelse av hardbunnskorallskog basert på mengdefordeling fra observasjoner på MAREANO tokt og miljødata fra andre kilder (se engelsk abstrakt). Datasettet representerer forventet tetthet av hornkoraller av artene Paragorgia arborea og Primnoa resedaeformis. Verdi-enheten er n/100m2. Datasettet er definert som en sårbar biotop av Havforskningsinstituttet. Datasettet er basert på videoanalyse og dekker havområder der kartleggingsprogrammet MAREANO har samlet inn videomateriale.
description: Modellert utbredelse av hardbunnskorallskog basert på mengdefordeling fra observasjoner på MAREANO tokt og miljødata fra andre kilder (se engelsk abstrakt). Datasettet representerer forventet tetthet av hornkoraller av artene Paragorgia arborea og Primnoa resedaeformis. Verdi-enheten er n/100m2. Datasettet er definert som en sårbar biotop av Havforskningsinstituttet. Datasettet er basert på videoanalyse og dekker havområder der kartleggingsprogrammet MAREANO har samlet inn videomateriale.
status: Sendt inn

Biotoper - Video observasjoner for klassifisering
type: Concept
in scheme: FAIR-register
top concept of: FAIR-register
definition: Video observasjoner for klassifisering av generelle biotoper i Barentshavet - MAREANO. Kartet viser video observasjoner som er brukt til å klassifisere generelle biotoper i Barentshavet basert på detaljerte videoanalyser. 27 biotoper er vist med ulike farger.
description: Video observasjoner for klassifisering av generelle biotoper i Barentshavet - MAREANO. Kartet viser video observasjoner som er brukt til å klassifisere generelle biotoper i Barentshavet basert på detaljerte videoanalyser. 27 biotoper er vist med ulike farger.
status: Sendt inn

Vannmasser - Overflatesaltholdighet
type: Concept
in scheme: FAIR-register
top concept of: FAIR-register
definition: Datasettet viser saltholdighet i havoverflaten og dekker pilotområdene Nye Stavanger kommune, Ålesund/Giske på Sunnmøre og Kvenangen i Troms.
description: Datasettet viser saltholdighet i havoverflaten og dekker pilotområdene Nye Stavanger kommune, Ålesund/Giske på Sunnmøre og Kvenangen i Troms.
status: Sendt inn

Vannmasser - Bunnstrøm
type: Concept
in scheme: FAIR-register
top concept of: FAIR-register
definition: Datasettet er en del av pilotprosjektet "Marine Grunnkart i Kystsonen" og viser strømstyrke noen meter over havbunnen. Det dekker de tre pilotområdene Nye Stavanger kommune, Ålesund/Giske på Sunnmøre og Kvenangen i Troms. Bunnstrøm er hentet ut fra en to år lang simulering med en tredimensjonal, hydrodynamisk strømmodell. Datasettet er tilgjengelig på nettsiden marinegrunnkart.avinet.no, for nedlasting og som tjenester (WFS, WMS) fra Havforskningsinstituttet.
description: Datasettet er en del av pilotprosjektet "Marine Grunnkart i Kystsonen" og viser strømstyrke noen meter over havbunnen. Det dekker de tre pilotområdene Nye Stavanger kommune, Ålesund/Giske på Sunnmøre og Kvenangen i Troms. Bunnstrøm er hentet ut fra en to år lang simulering med en tredimensjonal, hydrodynamisk strømmodell. Datasettet er tilgjengelig på nettsiden marinegrunnkart.avinet.no, for nedlasting og som tjenester (WFS, WMS) fra Havforskningsinstituttet.
status: Sendt inn

Menneskelig påvirkning -Tapte fiskeredskaper (langs videotransekt)
type: Concept
in scheme: FAIR-register
top concept of: FAIR-register
definition: Datasettet er en del av kartleggingsprosjektet Marine Grunnkart i Kystsonen og viser antall observerte tapte fiskeredskap på havbunnen, inkludert tauverk, teiner og deler av ødelagt fiskeredskap. Datasettet er basert på videoanalyse og dekker enkelte kystområder der kartleggingsprosjektet Marine Grunnkart i Kystsonen har samlet inn videomateriale.
description: Datasettet er en del av kartleggingsprosjektet Marine Grunnkart i Kystsonen og viser antall observerte tapte fiskeredskap på havbunnen, inkludert tauverk, teiner og deler av ødelagt fiskeredskap. Datasettet er basert på videoanalyse og dekker enkelte kystområder der kartleggingsprosjektet Marine Grunnkart i Kystsonen har samlet inn videomateriale.
status: Sendt inn

Referansedata - Videostasjoner
type: Concept
in scheme: FAIR-register
top concept of: FAIR-register
definition: Datasettet Referansedata - Videostasjoner er en del av marine grunnkart i kystsonen. Det er basert på videoanalyse og viser stedene der kartleggingsprosjektet Marine Grunnkart I Kystsonen har samlet inn videomateriale. Analysene fra videostasjonene er presentert i ulike punktdata-kartlag på www.marinegrunnkart.avinet.no
description: Datasettet Referansedata - Videostasjoner er en del av marine grunnkart i kystsonen. Det er basert på videoanalyse og viser stedene der kartleggingsprosjektet Marine Grunnkart I Kystsonen har samlet inn videomateriale. Analysene fra videostasjonene er presentert i ulike punktdata-kartlag på www.marinegrunnkart.avinet.no
status: Sendt inn

Bentisk sekundærproduksjon (produksjonsdata) grabb uten kolonidannende arter
type: Concept
in scheme: FAIR-register
top concept of: FAIR-register
definition: Bentisk sekundærproduksjon uten kolonidannende dyr (Årlig produksjon i kJoule per kvadratmeter) for grabb i spesifikke norske havområder som er undersøkt av MAREANO. Datasettet er en del av den tematiske datasettserien «Produktivitet – Bentisk sekundærproduksjon» består av datasett med modellert sekundærproduksjon (årlig produksjon i kilojoule per kvadratmeter) fra innsamlingsredskapene grabb og bomtrål (som tematiske datasett) med og uten kolonidannende dyr i spesifikke områder som er undersøkt av MAREANO programmet.
description: Bentisk sekundærproduksjon uten kolonidannende dyr (Årlig produksjon i kJoule per kvadratmeter) for grabb i spesifikke norske havområder som er undersøkt av MAREANO. Datasettet er en del av den tematiske datasettserien «Produktivitet – Bentisk sekundærproduksjon» består av datasett med modellert sekundærproduksjon (årlig produksjon i kilojoule per kvadratmeter) fra innsamlingsredskapene grabb og bomtrål (som tematiske datasett) med og uten kolonidannende dyr i spesifikke områder som er undersøkt av MAREANO programmet.
status: Sendt inn

Mareano videostasjoner
type: Concept
in scheme: FAIR-register
top concept of: FAIR-register
definition: Datasettet viser referansestasjoner der MAREANO har samlet inn ett sett med visuelle bunnprøver fra videorigg for å observere geologi og bunnfauna. Referansestasjonen er som regel forhåndsbestemt før toktene utfra tolkning av data fra mulitistråleekkolodd.
description: Datasettet viser referansestasjoner der MAREANO har samlet inn ett sett med visuelle bunnprøver fra videorigg for å observere geologi og bunnfauna. Referansestasjonen er som regel forhåndsbestemt før toktene utfra tolkning av data fra mulitistråleekkolodd.
status: Sendt inn

Bentisk sekundærproduksjon (produksjonsdata) bomtrål uten kolonidannende arter
type: Concept
in scheme: FAIR-register
top concept of: FAIR-register
definition: Bentisk sekundærproduksjon uten kolonidannende dyr (Årlig produksjon i kJoule per kvadratmeter) for bomtrål i spesifikke norske havområder som er undersøkt av MAREANO. Dalasettet er en del av den tematiske datasettserien «Produktivitet – Bentisk sekundærproduksjon» består av datasett med modellert sekundærproduksjon (årlig produksjon i kilojoule per kvadratmeter) fra innsamlingsredskapene grabb og bomtrål (som tematiske datasett) med og uten kolonidannende dyr i spesifikke områder som er undersøkt av MAREANO programmet.
description: Bentisk sekundærproduksjon uten kolonidannende dyr (Årlig produksjon i kJoule per kvadratmeter) for bomtrål i spesifikke norske havområder som er undersøkt av MAREANO. Dalasettet er en del av den tematiske datasettserien «Produktivitet – Bentisk sekundærproduksjon» består av datasett med modellert sekundærproduksjon (årlig produksjon i kilojoule per kvadratmeter) fra innsamlingsredskapene grabb og bomtrål (som tematiske datasett) med og uten kolonidannende dyr i spesifikke områder som er undersøkt av MAREANO programmet.
status: Sendt inn

Vannmasser - Overflatetemperatur
type: Concept
in scheme: FAIR-register
top concept of: FAIR-register
definition: Datasettet er en del av Marine Grunnkart i Kystsonen og viser sjøtemperatur i havoverflaten. Datasettet dekker de tre pilotområdene Nye Stavanger kommune, Ålesund/Giske på Sunnmøre samt Kvenangen i Troms. Overflatetemperatur er hentet ut fra en to år lang simulering med en tredimensjonal, hydrodynamisk strømmodell.
description: Datasettet er en del av Marine Grunnkart i Kystsonen og viser sjøtemperatur i havoverflaten. Datasettet dekker de tre pilotområdene Nye Stavanger kommune, Ålesund/Giske på Sunnmøre samt Kvenangen i Troms. Overflatetemperatur er hentet ut fra en to år lang simulering med en tredimensjonal, hydrodynamisk strømmodell.
status: Sendt inn

Mareano bunnprøver punkt
type: Concept
in scheme: FAIR-register
top concept of: FAIR-register
definition: Datasettet viser georefererte bunnprøvepunkt der MAREANO har samlet inn ett bunnprøver fra ulike ikke-tauede redskap (f.eks. vanVeen Grab, Multicorer, Boxcorer og CTD).
description: Datasettet viser georefererte bunnprøvepunkt der MAREANO har samlet inn ett bunnprøver fra ulike ikke-tauede redskap (f.eks. vanVeen Grab, Multicorer, Boxcorer og CTD).
status: Sendt inn

Vannmasser - Temperatur
type: Concept
in scheme: FAIR-register
top concept of: FAIR-register
definition: Datasettserien er en del av marine grunnkart i kystsonen. Datasettet i serien er foreløpig ikke tilgjengelig for nedlasting.
description: Datasettserien er en del av marine grunnkart i kystsonen. Datasettet i serien er foreløpig ikke tilgjengelig for nedlasting.
status: Sendt inn

Artsmangfold – Videoobservasjoner
type: Concept
in scheme: FAIR-register
top concept of: FAIR-register
definition: Datasettet viser antall observerte ulike arter pr. video-transekt og er basert på observasjoner av videomateriale av overflaten av havbunnen, samlet inn ved hjelp av videorigg. Opptak av havbunnens overflate ble gjort langs 200 m og 700 m lange transekt. Hvert punktsymbol er plottet på koordinatene for transektets midtpunkt, hvor symbolets størrelse korresponderer med antall observasjoner. MAREANO samler inn observasjoner fra videorigg for å kartlegge blant annet bunnfauna.
description: Datasettet viser antall observerte ulike arter pr. video-transekt og er basert på observasjoner av videomateriale av overflaten av havbunnen, samlet inn ved hjelp av videorigg. Opptak av havbunnens overflate ble gjort langs 200 m og 700 m lange transekt. Hvert punktsymbol er plottet på koordinatene for transektets midtpunkt, hvor symbolets størrelse korresponderer med antall observasjoner. MAREANO samler inn observasjoner fra videorigg for å kartlegge blant annet bunnfauna.
status: Sendt inn

Bentisk sekundærproduksjon (produksjonsdata) grabb med kolonidannende arter
type: Concept
in scheme: FAIR-register
top concept of: FAIR-register
definition: Bentisk sekundærproduksjon med kolonidannende dyr (Årlig produksjon i kJoule per kvadratmeter) for grabb i spesifikke norske havområder som er undersøkt av MAREANO. Datasettet er en del av den tematiske datasettserien «Produktivitet – Bentisk sekundærproduksjon» består av datasett med modellert sekundærproduksjon (årlig produksjon i kilojoule per kvadratmeter) fra innsamlingsredskapene grabb og bomtrål (som tematiske datasett) med og uten kolonidannende dyr i spesifikke områder som er undersøkt av MAREANO programmet.
description: Bentisk sekundærproduksjon med kolonidannende dyr (Årlig produksjon i kJoule per kvadratmeter) for grabb i spesifikke norske havområder som er undersøkt av MAREANO. Datasettet er en del av den tematiske datasettserien «Produktivitet – Bentisk sekundærproduksjon» består av datasett med modellert sekundærproduksjon (årlig produksjon i kilojoule per kvadratmeter) fra innsamlingsredskapene grabb og bomtrål (som tematiske datasett) med og uten kolonidannende dyr i spesifikke områder som er undersøkt av MAREANO programmet.
status: Sendt inn

Mareano bunnprøver linjer
type: Concept
in scheme: FAIR-register
top concept of: FAIR-register
definition: Datasettet viser georefererte bunnprøvelinjer der MAREANO har samlet inn bunnprøver fra ulike tauede redskap (f.eks. bomtrål, slede, grabb, video-rigg). Bunnprøver tas med tauede redskaper som bomtrål og RP-slede. Video-opptak med en tauet video-rigg.
description: Datasettet viser georefererte bunnprøvelinjer der MAREANO har samlet inn bunnprøver fra ulike tauede redskap (f.eks. bomtrål, slede, grabb, video-rigg). Bunnprøver tas med tauede redskaper som bomtrål og RP-slede. Video-opptak med en tauet video-rigg.
status: Sendt inn

Organiske miljøgifter i marine sedimenter
type: Concept
in scheme: FAIR-register
top concept of: FAIR-register
definition: Datasettet viser innholdet av organiske miljøgifter i marine sedimenter. Sedimentprøver for geokjemiske analyser er hentet primært fra områder med finkornete sedimenter både i åpne marine avsetningsmiljøer og kystnære havområder. Prøvetettheten varierer avhengig av lokalisering. Det er større prøvetetthet i fjorder og kystnære områder, mens det i åpne havområder er lavere prøvetetthet. Dataene er innsamlet på MAREANO-tokt i årene 2006-2021, for 2003-2004 er de samlet inn på overvåkingstokt i Barentshavet og noen stasjoner i i tre pilotområder i Marine grunnkart i kystsonen i 2020-2021.
description: Datasettet viser innholdet av organiske miljøgifter i marine sedimenter. Sedimentprøver for geokjemiske analyser er hentet primært fra områder med finkornete sedimenter både i åpne marine avsetningsmiljøer og kystnære havområder. Prøvetettheten varierer avhengig av lokalisering. Det er større prøvetetthet i fjorder og kystnære områder, mens det i åpne havområder er lavere prøvetetthet. Dataene er innsamlet på MAREANO-tokt i årene 2006-2021, for 2003-2004 er de samlet inn på overvåkingstokt i Barentshavet og noen stasjoner i i tre pilotområder i Marine grunnkart i kystsonen i 2020-2021.
status: Sendt inn

NiN grunntyper og hovedtyper av saltvannssjøbunn, punktobservasjoner
type: Concept
in scheme: FAIR-register
top concept of: FAIR-register
definition: Datasettet er en del av Marine Grunnkart i Kystsonen og viser observerte forekomster av de ulike grunn- og hovedtypene innenfor saltvannsbunnsystemer definert av Artsdatabanken. Saltvannsbunnsystemer, også kalt marine bunnsystemer, omfatter økosystemer i saltvann (saltholdighet > 0,5 ‰); det vil si som finnes i, på og nært knyttet til bunnen i havet, fjorder, poller og litoralbasseng. Datasettet er basert på videoanalyse og dekker enkelte kystområder der kartleggingsprosjektet Marine Grunnkart I Kystsonen har samlet inn videomateriale. Foreløpig er Stavanger og Sunnmøre dekket.
description: Datasettet er en del av Marine Grunnkart i Kystsonen og viser observerte forekomster av de ulike grunn- og hovedtypene innenfor saltvannsbunnsystemer definert av Artsdatabanken. Saltvannsbunnsystemer, også kalt marine bunnsystemer, omfatter økosystemer i saltvann (saltholdighet > 0,5 ‰); det vil si som finnes i, på og nært knyttet til bunnen i havet, fjorder, poller og litoralbasseng. Datasettet er basert på videoanalyse og dekker enkelte kystområder der kartleggingsprosjektet Marine Grunnkart I Kystsonen har samlet inn videomateriale. Foreløpig er Stavanger og Sunnmøre dekket.
status: Sendt inn

Sårbare marine bunndyr - observasjonsdata
type: Concept
in scheme: FAIR-register
top concept of: FAIR-register
definition: Datasettet viser relativ mengde av ulike grupper av sårbare fastsittende dyr. Mengden er beregnet som antall observasjoner per videostasjon. Dataene representerer punktobservasjoner og er egnet for å sammenlikne resultater fra romlige prediktive modeller for ulike sårbare habitater og som bakgrunn for forvaltning av sårbare områder. Dataene er presentert separat for følgende habitater eller biotoper: Glassvampsamfunn, svampskog, blomkålkorallskog, sjøfjærbunn, bløtbunnskorallskog, svampspikelbunn, Umbellula-bestander og hardbunnskorallskog. Datagrunnlaget er MAREANOs tokt i perioden 2006-2024.
description: Datasettet viser relativ mengde av ulike grupper av sårbare fastsittende dyr. Mengden er beregnet som antall observasjoner per videostasjon. Dataene representerer punktobservasjoner og er egnet for å sammenlikne resultater fra romlige prediktive modeller for ulike sårbare habitater og som bakgrunn for forvaltning av sårbare områder. Dataene er presentert separat for følgende habitater eller biotoper: Glassvampsamfunn, svampskog, blomkålkorallskog, sjøfjærbunn, bløtbunnskorallskog, svampspikelbunn, Umbellula-bestander og hardbunnskorallskog. Datagrunnlaget er MAREANOs tokt i perioden 2006-2024.
status: Sendt inn

Bentisk sekundærproduksjon (produksjonsdata) bomtrål med kolonidannende arter
type: Concept
in scheme: FAIR-register
top concept of: FAIR-register
definition: Bentisk sekundærproduksjon med kolonidannende dyr (Årlig produksjon i kJoule per kvadratmeter) for bomtrål i spesifikke norske havområder som er undersøkt av MAREANO. Datasettet er en del av den tematiske datasettserien «Produktivitet – Bentisk sekundærproduksjon» består av datasett med modellert sekundærproduksjon (årlig produksjon i kilojoule per kvadratmeter) fra innsamlingsredskapene grabb og bomtrål (som tematiske datasett) med og uten kolonidannende dyr i spesifikke områder som er undersøkt av MAREANO programmet.
description: Bentisk sekundærproduksjon med kolonidannende dyr (Årlig produksjon i kJoule per kvadratmeter) for bomtrål i spesifikke norske havområder som er undersøkt av MAREANO. Datasettet er en del av den tematiske datasettserien «Produktivitet – Bentisk sekundærproduksjon» består av datasett med modellert sekundærproduksjon (årlig produksjon i kilojoule per kvadratmeter) fra innsamlingsredskapene grabb og bomtrål (som tematiske datasett) med og uten kolonidannende dyr i spesifikke områder som er undersøkt av MAREANO programmet.
status: Sendt inn

Naturtyper - Sjøfjærbunn, predikert
type: Concept
in scheme: FAIR-register
top concept of: FAIR-register
definition: Datasettet er en del av Marine Grunnkart i Kystsonen og viser relativ sannsynlighet for tilstedeværelse av, eller leveforhold for et bunnsamfunn definert av følgende karakteristiske arter/taxa (Indikatorarter): Funiculina quadrangularis, Halipteris christii, H. finmarchia, Halipteris sp., Kophobelemnon stelliferum, Pennatula phosphorea, Pennatula sp., Pennatulacea indet., Protoptilum thomsoni, Stylatula elegans, Virgularia mirabilis, Virgularia. sp.,
description: Datasettet er en del av Marine Grunnkart i Kystsonen og viser relativ sannsynlighet for tilstedeværelse av, eller leveforhold for et bunnsamfunn definert av følgende karakteristiske arter/taxa (Indikatorarter): Funiculina quadrangularis, Halipteris christii, H. finmarchia, Halipteris sp., Kophobelemnon stelliferum, Pennatula phosphorea, Pennatula sp., Pennatulacea indet., Protoptilum thomsoni, Stylatula elegans, Virgularia mirabilis, Virgularia. sp.,
status: Sendt inn

Mareano referansestasjoner
type: Concept
in scheme: FAIR-register
top concept of: FAIR-register
definition: Datasettet viser referansestasjoner der MAREANO har samlet inn ett sett med visuelle og fysiske bunnprøver fra ulike redskap (f.eks. videorigg, bomtrål, slede, grabb, boxcorer, multicorer). Referansestasjonen er som regel forhåndsbestemt før toktene utfra tolkning av data fra mulitistråleekkolodd.
description: Datasettet viser referansestasjoner der MAREANO har samlet inn ett sett med visuelle og fysiske bunnprøver fra ulike redskap (f.eks. videorigg, bomtrål, slede, grabb, boxcorer, multicorer). Referansestasjonen er som regel forhåndsbestemt før toktene utfra tolkning av data fra mulitistråleekkolodd.
status: Sendt inn

Biomangfold - Arter - ti på topp (pr stasjon)
type: Concept
in scheme: FAIR-register
top concept of: FAIR-register
definition: Biomangfold - Arter - ti på topp, per stasjon. ”Topp-ti-dominante arter per redskap” som kumulativ antall individ i prosent og kumulativ våtvekt i prosent.
description: Biomangfold - Arter - ti på topp, per stasjon. ”Topp-ti-dominante arter per redskap” som kumulativ antall individ i prosent og kumulativ våtvekt i prosent.
status: Sendt inn

Hornkoraller
type: Concept
in scheme: FAIR-register
top concept of: FAIR-register
definition: Datasettet viser forekomster av hornkoraller (bløtbunns- og hardbunnskorallskog) observert på MAREANO-toktene. De vanligste artene av hornkoraller som danner bløtbunnskorallskog er Isidella lofotensis og Radicipes gracilis. De vanligste artene av hornkoraller som danner hardbunnskorallskog er Paragorgia arborea, Primnoa resedaeformis, Paramuricea placomus og Swiftia (i Mareano-området er ikke Swiftia påvist med sikkerhet). Datasettet er vist som punktdata av enkeltforekomster med hornkoraller basert på visuelle observasjoner langs video-transekt der MAREANO har samlet inn videomateriale.
description: Datasettet viser forekomster av hornkoraller (bløtbunns- og hardbunnskorallskog) observert på MAREANO-toktene. De vanligste artene av hornkoraller som danner bløtbunnskorallskog er Isidella lofotensis og Radicipes gracilis. De vanligste artene av hornkoraller som danner hardbunnskorallskog er Paragorgia arborea, Primnoa resedaeformis, Paramuricea placomus og Swiftia (i Mareano-området er ikke Swiftia påvist med sikkerhet). Datasettet er vist som punktdata av enkeltforekomster med hornkoraller basert på visuelle observasjoner langs video-transekt der MAREANO har samlet inn videomateriale.
status: Sendt inn

Artsmangfold - Videoobserverte korallbunntyper
type: Concept
in scheme: FAIR-register
top concept of: FAIR-register
definition: Datasettet viser observasjoner av ulike korallbunntyper (Levende Lophelia, Korallrester og Død Lophelia) som er loggført i felt under videoundersøkelse av havbunnen. Korallrester er små skjellett-fragmenter (< 20 cm) av døde Lophelia koraller, mens Død Lophelia er større (>20 cm) fragmenter av døde korallskjelletter. Levende Lophelia er kolonier av levende Lophelia, med ulik størrelse. Sammen med havbunnstopografien gir disse observasjonene en indikasjon på utstrekningen av korallrevene lokalt. Datasettet viser også videotransekt der det ikke er observert noen av disse koralbunntypene.
description: Datasettet viser observasjoner av ulike korallbunntyper (Levende Lophelia, Korallrester og Død Lophelia) som er loggført i felt under videoundersøkelse av havbunnen. Korallrester er små skjellett-fragmenter (< 20 cm) av døde Lophelia koraller, mens Død Lophelia er større (>20 cm) fragmenter av døde korallskjelletter. Levende Lophelia er kolonier av levende Lophelia, med ulik størrelse. Sammen med havbunnstopografien gir disse observasjonene en indikasjon på utstrekningen av korallrevene lokalt. Datasettet viser også videotransekt der det ikke er observert noen av disse koralbunntypene.
status: Sendt inn

Naturtyper – Svamphage, predikert
type: Concept
in scheme: FAIR-register
top concept of: FAIR-register
definition: Dette datasettet viser den relative sannsynligheten for forekomst av (eller egnethet for) et bunndyrsamfunn med følgende parametere: Karakteristiske arter/taxa: Antho dichotoma, Axinella infundibuliformis, Axinellidae indet, Phakellia ventilabrum, Phakellia sp., Mycale lingua. Substrat: Hardbunn (dominans av: grus, stein, blokk eller bart fjell) dominert av en eller flere hardbunnsbunntyper i blanding. Tetthet av karakteristiske arter: > 20 kolonier per 100 m2. Dette tilsvarer habitatet som er oppført av ICES som "Hard-bottom sponge aggregations", eller Svampehage på norsk.
description: Dette datasettet viser den relative sannsynligheten for forekomst av (eller egnethet for) et bunndyrsamfunn med følgende parametere: Karakteristiske arter/taxa: Antho dichotoma, Axinella infundibuliformis, Axinellidae indet, Phakellia ventilabrum, Phakellia sp., Mycale lingua. Substrat: Hardbunn (dominans av: grus, stein, blokk eller bart fjell) dominert av en eller flere hardbunnsbunntyper i blanding. Tetthet av karakteristiske arter: > 20 kolonier per 100 m2. Dette tilsvarer habitatet som er oppført av ICES som "Hard-bottom sponge aggregations", eller Svampehage på norsk.
status: Sendt inn

Søppel pr. Mareano-stasjon
type: Concept
in scheme: FAIR-register
top concept of: FAIR-register
definition: Antall søppelobjekter observert på havbunnen pr. 100 meter på videostasjoner fra Mareano-toktene. Datasettet viser antall observerte objekter (større enn 5 cm) på havbunnen som er kategorisert som søppel. Under søppel inngår alle elementer som er menneskeskapte. Datasettet er basert på videoobservasjoner og dekker områder der kartleggingsprosjektet MAREANO har samlet inn videomateriale. Datasettet er basert på tolkning av videomateriale av overflaten av havbunnen, samlet inn ved hjelp av videorigg. Opptak av havbunnens overflate ble gjort langs 200 m og 700 m lange transekt. Alle objekter identifisert som søppel, er registrert langs hvert transekt. Variabelen ‘søppel’ er numerisk.
description: Antall søppelobjekter observert på havbunnen pr. 100 meter på videostasjoner fra Mareano-toktene. Datasettet viser antall observerte objekter (større enn 5 cm) på havbunnen som er kategorisert som søppel. Under søppel inngår alle elementer som er menneskeskapte. Datasettet er basert på videoobservasjoner og dekker områder der kartleggingsprosjektet MAREANO har samlet inn videomateriale. Datasettet er basert på tolkning av videomateriale av overflaten av havbunnen, samlet inn ved hjelp av videorigg. Opptak av havbunnens overflate ble gjort langs 200 m og 700 m lange transekt. Alle objekter identifisert som søppel, er registrert langs hvert transekt. Variabelen ‘søppel’ er numerisk.
status: Sendt inn

Vannmasser - Bunntemperatur
type: Concept
in scheme: FAIR-register
top concept of: FAIR-register
definition: Datasettet er en del av pilotprosjektet "Marine Grunnkart i Kystsonen" og viser sjøtemperatur noen meter over havbunnen. Datasettet er tilgjengelig som WFS, WMS, for nedlasting og gjennom Marine grunnkart sin webportal https://marinegrunnkart.avinet.no/, som hhv gjennomsnittsverdier, 10. percentil og 90. percentil. Det dekker tre pilotområder: Nye Stavanger kommune, Kvænangen i Troms og Ålesund/Giske på Sunnmøre. Bunntemperatur er hentet ut fra en to år lang simulering med en tredimensjonal, hydrodynamisk strømmodell.
description: Datasettet er en del av pilotprosjektet "Marine Grunnkart i Kystsonen" og viser sjøtemperatur noen meter over havbunnen. Datasettet er tilgjengelig som WFS, WMS, for nedlasting og gjennom Marine grunnkart sin webportal https://marinegrunnkart.avinet.no/, som hhv gjennomsnittsverdier, 10. percentil og 90. percentil. Det dekker tre pilotområder: Nye Stavanger kommune, Kvænangen i Troms og Ålesund/Giske på Sunnmøre. Bunntemperatur er hentet ut fra en to år lang simulering med en tredimensjonal, hydrodynamisk strømmodell.
status: Sendt inn

Naturtyper - Tarebiomasse, predikert
type: Concept
in scheme: FAIR-register
top concept of: FAIR-register
definition: Datasettet Tarebiomasse, predikert er en del av pilotprosjektet Marine Grunnkart i Kystsonen og distribuert i kategorien Naturtyper. Modellert resultat viser predikert mengde stortare angitt i enheten kilo tare per kvadratmeter.
description: Datasettet Tarebiomasse, predikert er en del av pilotprosjektet Marine Grunnkart i Kystsonen og distribuert i kategorien Naturtyper. Modellert resultat viser predikert mengde stortare angitt i enheten kilo tare per kvadratmeter.
status: Sendt inn

Mareanoprøver - Artsmangfold, individer og biomasse
type: Concept
in scheme: FAIR-register
top concept of: FAIR-register
definition: Tematisk datasettserie som består av datasett for «Artsmangfold, individer og biomasse» fra innsamlingsredskapene grabb, slede og bomtrål. Datasettet viser punkt med analyserte fysiske prøver fra grabb, slede og bomtrål (som er tematiske datasett). Datasettet viser artsmangfold (ved antall ulike arter), individer (aggregert sum av antall individer) og biomasse (aggregert verdi av individvekt).
description: Tematisk datasettserie som består av datasett for «Artsmangfold, individer og biomasse» fra innsamlingsredskapene grabb, slede og bomtrål. Datasettet viser punkt med analyserte fysiske prøver fra grabb, slede og bomtrål (som er tematiske datasett). Datasettet viser artsmangfold (ved antall ulike arter), individer (aggregert sum av antall individer) og biomasse (aggregert verdi av individvekt).
status: Sendt inn

Sårbare marine biotoper – modellert utbredelse Glassvampsamfunn
type: Concept
in scheme: FAIR-register
top concept of: FAIR-register
definition: Modellert utbredelse av sårbare marine biotoper basert på mengdefordeling fra observasjoner på MAREANO tokt og miljødata fra andre kilder. Biotopene er karakterisert av skjøre organismer som lett knuses ved fysisk påvirkning av havbunnen. Kartene viser områder hvor vi kan forvente å finne slike naturtyper basert på resultater fra matematiske modeller. Verdi-enheten er n/100m2. Datasettet viser forekomsten av Glassvampsamfunn og er definert som en sårbar biotop av Havforskningsinstituttet. Datasettet er basert på videoanalyse og dekker havområder der kartleggingsprogrammet MAREANO har samlet inn videomateriale.
description: Modellert utbredelse av sårbare marine biotoper basert på mengdefordeling fra observasjoner på MAREANO tokt og miljødata fra andre kilder. Biotopene er karakterisert av skjøre organismer som lett knuses ved fysisk påvirkning av havbunnen. Kartene viser områder hvor vi kan forvente å finne slike naturtyper basert på resultater fra matematiske modeller. Verdi-enheten er n/100m2. Datasettet viser forekomsten av Glassvampsamfunn og er definert som en sårbar biotop av Havforskningsinstituttet. Datasettet er basert på videoanalyse og dekker havområder der kartleggingsprogrammet MAREANO har samlet inn videomateriale.
status: Sendt inn

Artsmangfold – Svampobservasjoner per videotransekt
type: Concept
in scheme: FAIR-register
top concept of: FAIR-register
definition: Datasettet viser antall svampobservasjoner per video-transekt og er basert på observasjoner av videomateriale av overflaten av havbunnen, samlet inn ved hjelp av videorigg. Opptak av havbunnens overflate ble gjort langs 200 m og 700 m lange transekt. Hvert punktsymbol er plottet på koordinatene for transektets midtpunkt, hvor symbolets størrelse korresponderer med antall observasjoner.
description: Datasettet viser antall svampobservasjoner per video-transekt og er basert på observasjoner av videomateriale av overflaten av havbunnen, samlet inn ved hjelp av videorigg. Opptak av havbunnens overflate ble gjort langs 200 m og 700 m lange transekt. Hvert punktsymbol er plottet på koordinatene for transektets midtpunkt, hvor symbolets størrelse korresponderer med antall observasjoner.
status: Sendt inn

Mareano bunnprøvestasjoner
type: Concept
in scheme: FAIR-register
top concept of: FAIR-register
definition: Bunnprøvestasjoner tatt på Mareano-tokt pr. år. Datasettet viser referansestasjoner der MAREANO har samlet inn ett sett med fysiske bunnprøver fra ulike redskap (f.eks. bomtrål, slede, grabb, boxcorer, multicorer). Referansestasjonen er som regel forhåndsbestemt før toktene utfra tolkning av data fra mulitistråleekkolodd.
description: Bunnprøvestasjoner tatt på Mareano-tokt pr. år. Datasettet viser referansestasjoner der MAREANO har samlet inn ett sett med fysiske bunnprøver fra ulike redskap (f.eks. bomtrål, slede, grabb, boxcorer, multicorer). Referansestasjonen er som regel forhåndsbestemt før toktene utfra tolkning av data fra mulitistråleekkolodd.
status: Sendt inn

Vannmasser – Bunnsaltholdighet
type: Concept
in scheme: FAIR-register
top concept of: FAIR-register
definition: Datasettet er en del av prosjektet «Marine Grunnkart i Kystsonen» og viser saltholdighet noen meter over havbunnen. Tilgjengelig som WFS, WMS, for nedlasting og gjennom Marine grunnkart sin webportal https://marinegrunnkart.avinet.no/, i hhv gjennomsnittsverdier, 10. percentil og 90. percentil. Det dekker tre pilotområder: Nye Stavanger kommune, Kvænangen i Troms og Ålesund/Giske på Sunnmøre. Bunnsaltholdighet er hentet ut fra en to år lang simulering med en tredimensjonal, hydrodynamisk strømmodell.
description: Datasettet er en del av prosjektet «Marine Grunnkart i Kystsonen» og viser saltholdighet noen meter over havbunnen. Tilgjengelig som WFS, WMS, for nedlasting og gjennom Marine grunnkart sin webportal https://marinegrunnkart.avinet.no/, i hhv gjennomsnittsverdier, 10. percentil og 90. percentil. Det dekker tre pilotområder: Nye Stavanger kommune, Kvænangen i Troms og Ålesund/Giske på Sunnmøre. Bunnsaltholdighet er hentet ut fra en to år lang simulering med en tredimensjonal, hydrodynamisk strømmodell.
status: Sendt inn

Naturtyper - Sårbare marine habitater
type: Concept
in scheme: FAIR-register
top concept of: FAIR-register
definition: Datasettet er en del av pilotprosjektet "Marine Grunnkart i Kystsonen" og viser forekomsten av åtte forskjellige habitater som er definert som sårbare; Cerianthidebunn, dødt korallrev, hardbunnskorallskog, reirskjell, ruglbunn, sjøfjærbunn, svamphage og ålegraseng. Datasettet er basert på videoanalyse og dekker enkelte kystområder der kartleggingsprosjektet Marine Grunnkart i Kystsonen har samlet inn videomateriale.
description: Datasettet er en del av pilotprosjektet "Marine Grunnkart i Kystsonen" og viser forekomsten av åtte forskjellige habitater som er definert som sårbare; Cerianthidebunn, dødt korallrev, hardbunnskorallskog, reirskjell, ruglbunn, sjøfjærbunn, svamphage og ålegraseng. Datasettet er basert på videoanalyse og dekker enkelte kystområder der kartleggingsprosjektet Marine Grunnkart i Kystsonen har samlet inn videomateriale.
status: Sendt inn

Sårbare marine biotoper – modellert utbredelse Svampspikelbunn
type: Concept
in scheme: FAIR-register
top concept of: FAIR-register
definition: Modellert utbredelse av sårbare marine biotoper basert på mengdefordeling fra observasjoner på MAREANO tokt og miljødata fra andre kilder. Biotopene er karakterisert av skjøre organismer som lett knuses ved fysisk påvirkning av havbunnen. Kartene viser områder hvor vi kan forvente å finne slike naturtyper basert på resultater fra matematiske modeller. Verdi-enheten er n/100m2. Datasettet viser forekomsten av Svampspikelbunn og er definert som en sårbar biotop av Havforskningsinstituttet. Datasettet er basert på videoanalyse og dekker havområder der kartleggingsprogrammet MAREANO har samlet inn videomateriale.
description: Modellert utbredelse av sårbare marine biotoper basert på mengdefordeling fra observasjoner på MAREANO tokt og miljødata fra andre kilder. Biotopene er karakterisert av skjøre organismer som lett knuses ved fysisk påvirkning av havbunnen. Kartene viser områder hvor vi kan forvente å finne slike naturtyper basert på resultater fra matematiske modeller. Verdi-enheten er n/100m2. Datasettet viser forekomsten av Svampspikelbunn og er definert som en sårbar biotop av Havforskningsinstituttet. Datasettet er basert på videoanalyse og dekker havområder der kartleggingsprogrammet MAREANO har samlet inn videomateriale.
status: Sendt inn

Mareano kjemistasjoner
type: Concept
in scheme: FAIR-register
top concept of: FAIR-register
definition: Datasettet viser posisjon der det er samlet inn sedimentprøver for analyse av kjemiske sammensetninger. Mareanos Kjemiprogram er ansvarlig for innsamling, analyse og rapportering av havbunnssedimenter og deres kjemiske sammensetning inkl. utvalgte miljøgifter. Selve måledataene hentes fra datasettet Organiske miljøgifter i marine sedimenter. Stasjoner med analyserte kjemiprøver pr. år. Årene 2006-2021 er prøvene samlet inn på Mareano-tokt, for 2003-2004 er de samlet inn på overvåkingstokt i Barentshavet og noen stasjoner i Marine grunnkart i kystsonen i 2020-2021.
description: Datasettet viser posisjon der det er samlet inn sedimentprøver for analyse av kjemiske sammensetninger. Mareanos Kjemiprogram er ansvarlig for innsamling, analyse og rapportering av havbunnssedimenter og deres kjemiske sammensetning inkl. utvalgte miljøgifter. Selve måledataene hentes fra datasettet Organiske miljøgifter i marine sedimenter. Stasjoner med analyserte kjemiprøver pr. år. Årene 2006-2021 er prøvene samlet inn på Mareano-tokt, for 2003-2004 er de samlet inn på overvåkingstokt i Barentshavet og noen stasjoner i Marine grunnkart i kystsonen i 2020-2021.
status: Sendt inn

Menneskelig påvirkning - Marint søppel per videotransekt
type: Concept
in scheme: FAIR-register
top concept of: FAIR-register
definition: Datasettet er en del av prosjektet «Marine Grunnkart i Kystsonen», og viser antall observerte objekter (større enn 5 cm) på havbunnen som er kategorisert som søppel. Under søppel inngår alle elementer som er menneskeskapte, ikke inkludert fiskeredskap. Datasettet er basert på videoanalyse og dekker enkelte kystområder der kartleggingsprosjektet Marine Grunnkart i Kystsonen har samlet inn videomateriale.
description: Datasettet er en del av prosjektet «Marine Grunnkart i Kystsonen», og viser antall observerte objekter (større enn 5 cm) på havbunnen som er kategorisert som søppel. Under søppel inngår alle elementer som er menneskeskapte, ikke inkludert fiskeredskap. Datasettet er basert på videoanalyse og dekker enkelte kystområder der kartleggingsprosjektet Marine Grunnkart i Kystsonen har samlet inn videomateriale.
status: Sendt inn

Menneskelig påvirkning -Trålspor per videotransekt
type: Concept
in scheme: FAIR-register
top concept of: FAIR-register
definition: Datasettet er en del av pilotprosjektet Marine Grunnkart i Kystsonen og viser antall observerte spor fra bunntrål på havbunnen. Datasettet er basert på videoanalyse og dekker enkelte kystområder der kartleggingsprosjektet Marine Grunnkart i Kystsonen har samlet inn videomateriale.
description: Datasettet er en del av pilotprosjektet Marine Grunnkart i Kystsonen og viser antall observerte spor fra bunntrål på havbunnen. Datasettet er basert på videoanalyse og dekker enkelte kystområder der kartleggingsprosjektet Marine Grunnkart i Kystsonen har samlet inn videomateriale.
status: Sendt inn

Vannmasser - Saltholdighet
type: Concept
in scheme: FAIR-register
top concept of: FAIR-register
definition: Datasettserien er en del av marine grunnkart i kystsonen. Datasett i serien er foreløpig ikke tilgjengelig for nedlasting.
description: Datasettserien er en del av marine grunnkart i kystsonen. Datasett i serien er foreløpig ikke tilgjengelig for nedlasting.
status: Sendt inn

Sårbare marine biotoper – modellert utbredelse Umbellula bestander
type: Concept
in scheme: FAIR-register
top concept of: FAIR-register
definition: Modellert utbredelse av sårbare marine biotoper basert på mengdefordeling fra observasjoner på MAREANO tokt og miljødata fra andre kilder. Biotopene er karakterisert av skjøre organismer som lett knuses ved fysisk påvirkning av havbunnen. Kartene viser områder hvor vi kan forvente å finne slike naturtyper basert på resultater fra matematiske modeller. Verdi-enheten er n/100m2. Datasettet viser forekomsten av dyphavssjøfjæren Umbellula encrinus og er definert som en sårbar biotop av Havforskningsinstituttet. Datasettet er basert på videoanalyse og dekker havområder der kartleggingsprogrammet MAREANO har samlet inn videomateriale. Dyphavssjøfjæren Umbellula encrinus forekommer stedvis relativt tett fra midtre kontinentalskråning (ca 800 m dyp) og nedover. Denne store sjøfjæren kan bli mer enn 2 meter høy. Umbellula kan sies å representere dyphavets svar på sjøfjærbunn som finnes på grunnere vann i Atlantisk vann. Ofte forekommer det høye tettheter av hulebyggende amfipoder (samme krepsdyrgruppe som tanglopper tilhører) i områder med Umbellula.
description: Modellert utbredelse av sårbare marine biotoper basert på mengdefordeling fra observasjoner på MAREANO tokt og miljødata fra andre kilder. Biotopene er karakterisert av skjøre organismer som lett knuses ved fysisk påvirkning av havbunnen. Kartene viser områder hvor vi kan forvente å finne slike naturtyper basert på resultater fra matematiske modeller. Verdi-enheten er n/100m2. Datasettet viser forekomsten av dyphavssjøfjæren Umbellula encrinus og er definert som en sårbar biotop av Havforskningsinstituttet. Datasettet er basert på videoanalyse og dekker havområder der kartleggingsprogrammet MAREANO har samlet inn videomateriale. Dyphavssjøfjæren Umbellula encrinus forekommer stedvis relativt tett fra midtre kontinentalskråning (ca 800 m dyp) og nedover. Denne store sjøfjæren kan bli mer enn 2 meter høy. Umbellula kan sies å representere dyphavets svar på sjøfjærbunn som finnes på grunnere vann i Atlantisk vann. Ofte forekommer det høye tettheter av hulebyggende amfipoder (samme krepsdyrgruppe som tanglopper tilhører) i områder med Umbellula.
status: Sendt inn

Vannmasser - Overflatestrøm
type: Concept
in scheme: FAIR-register
top concept of: FAIR-register
definition: Datasettet er en del av prosjektet «Marine Grunnkart i Kystsonen» og viser modellert strømstyrke i havoverflaten. Det dekker pilotområdene området til Nye Stavanger kommune og Ålesund/Giske på Sunnmøre. Overflatestrøm er hentet ut fra en to år lang simulering med en tredimensjonal, hydrodynamisk strømmodell.
description: Datasettet er en del av prosjektet «Marine Grunnkart i Kystsonen» og viser modellert strømstyrke i havoverflaten. Det dekker pilotområdene området til Nye Stavanger kommune og Ålesund/Giske på Sunnmøre. Overflatestrøm er hentet ut fra en to år lang simulering med en tredimensjonal, hydrodynamisk strømmodell.
status: Sendt inn

Vannmasser - Bølgeeksponering ved bunn
type: Concept
in scheme: FAIR-register
top concept of: FAIR-register
definition: Datasettet er en del av marine grunnkart i kystsonen og viser modellert bølgeeksponering mot sjøbunn. Detaljert angir datasettet den maksimale horisontale farten til bølgenes orbitale bevegelse ved sjøbunn, og dette er basert på signifikant bølgehøyde, bølgefrekvens (bølgeperiode) og bunndypet. Datasettet dekker området til Nye Stavanger kommune og Ålesund/Giske på Sunnmøre.
description: Datasettet er en del av marine grunnkart i kystsonen og viser modellert bølgeeksponering mot sjøbunn. Detaljert angir datasettet den maksimale horisontale farten til bølgenes orbitale bevegelse ved sjøbunn, og dette er basert på signifikant bølgehøyde, bølgefrekvens (bølgeperiode) og bunndypet. Datasettet dekker området til Nye Stavanger kommune og Ålesund/Giske på Sunnmøre.
status: Sendt inn

Bentisk sekundærproduksjon
type: Concept
in scheme: FAIR-register
top concept of: FAIR-register
definition: Tematisk datasettserien «Produktivitet – Bentisk sekundærproduksjon» består av datasett med modellert sekundærproduksjon (årlig produksjon i kilojoule per kvadratmeter) fra innsamlingsredskapene grabb og bomtrål (som tematiske datasett) med og uten kolonidannende dyr i spesifikke områder som er undersøkt av MAREANO programmet. Datasettserien består av fire datasett: Bentisk sekundærproduksjon (produksjonsdata) bomtrål med kolonidannende arter Bentisk sekundærproduksjon (produksjonsdata) bomtrål uten kolonidannende arter Bentisk sekundærproduksjon (produksjonsdata) grabb med kolonidannende arter Bentisk sekundærproduksjon (produksjonsdata) grabb uten kolonidannende arter I tillegg til bomtrål og grabb blir det også tatt prøver med bentisk slede. Det er ikke beregnet bentisk sekundærproduksjon fra slede da dette ikke blir representativt.
description: Tematisk datasettserien «Produktivitet – Bentisk sekundærproduksjon» består av datasett med modellert sekundærproduksjon (årlig produksjon i kilojoule per kvadratmeter) fra innsamlingsredskapene grabb og bomtrål (som tematiske datasett) med og uten kolonidannende dyr i spesifikke områder som er undersøkt av MAREANO programmet. Datasettserien består av fire datasett: Bentisk sekundærproduksjon (produksjonsdata) bomtrål med kolonidannende arter Bentisk sekundærproduksjon (produksjonsdata) bomtrål uten kolonidannende arter Bentisk sekundærproduksjon (produksjonsdata) grabb med kolonidannende arter Bentisk sekundærproduksjon (produksjonsdata) grabb uten kolonidannende arter I tillegg til bomtrål og grabb blir det også tatt prøver med bentisk slede. Det er ikke beregnet bentisk sekundærproduksjon fra slede da dette ikke blir representativt.
status: Sendt inn

Korallrev
type: Concept
in scheme: FAIR-register
top concept of: FAIR-register
definition: Kartet viser dokumenterte og stedfestede korallrev av steinkorallen Lophelia pertusa (Desmophyllum pertusum). Forekomstene av korallrev er angitt som punkter på kart. Disse utgjør verdifull informasjon som beslutningsgrunnlag ved vurdering av nye oppdrettskonsesjoner, utslipp i sjø, deponering, utbygging av petroleumsrelaterte installasjoner, og regulering av fiskeriaktivitet. For mer informasjon om korallrev se: https://www.mareano.no/tema/kaldtvannskoraller/korallrev-1 Visning på MAREANO kartportal: https://kart.mareano.no/mareano/mareanoPolar.html?#maps/7555
description: Kartet viser dokumenterte og stedfestede korallrev av steinkorallen Lophelia pertusa (Desmophyllum pertusum). Forekomstene av korallrev er angitt som punkter på kart. Disse utgjør verdifull informasjon som beslutningsgrunnlag ved vurdering av nye oppdrettskonsesjoner, utslipp i sjø, deponering, utbygging av petroleumsrelaterte installasjoner, og regulering av fiskeriaktivitet. For mer informasjon om korallrev se: https://www.mareano.no/tema/kaldtvannskoraller/korallrev-1 Visning på MAREANO kartportal: https://kart.mareano.no/mareano/mareanoPolar.html?#maps/7555
status: Sendt inn

Vannmasser - Bølgehøyde
type: Concept
in scheme: FAIR-register
top concept of: FAIR-register
definition: Datasettet er en del av prosjektet «Marine Grunnkart i Kystsonen» og viser modellert signifikant bølgehøyde som er et mål på gjennomsnittshøyden av de 1/3 høyeste bølgene. Datasettet dekker foreløpig området til Nye Stavanger kommune og Ålesund/Giske på Sunnmøre.
description: Datasettet er en del av prosjektet «Marine Grunnkart i Kystsonen» og viser modellert signifikant bølgehøyde som er et mål på gjennomsnittshøyden av de 1/3 høyeste bølgene. Datasettet dekker foreløpig området til Nye Stavanger kommune og Ålesund/Giske på Sunnmøre.
status: Sendt inn