FAIR-register
type: ConceptScheme
description: Register som viser FAIR-status for alle DOK-data, Mareano-data og Marine grunnkart-data

Radon aktsomhet
type: Concept
in scheme: FAIR-register
top concept of: FAIR-register
definition: Datasettet viser hvilke områder i Norge som trolig er mer radonutsatt enn andre. Datasettet er basert på geologi og inneluftsmålinger av radon. Inneluftsmålinger er fra NRPA sin nasjonale database, og geologi er fra NGU sine berggrunns- og løsmassedatabaser. Berggrunnsdata er av målestokk 1:250.000 og løsmassedata er av varierende målestokk, fra 1:50.000 til 1:1000.000. Inneluftsmålinger er brukt til å identifisere områder med forhøyd aktsomhet for radon, totalt 34563 geo-refererte målepunkt. De er også brukt til å kjennetegne geologi i forhold til aktsomhet for radon, og denne kunnskapen er overført til områder hvor det finnes ingen eller få inneluftsmålinger. Der hvor et område er klassifisert som «høy aktsomhet» er det beregnet at minst 20% av boligene har radonkonsentrasjoner over 200 Bq/m3, med 70% statistisk sikkerhet. Der hvor et område er klassifisert som «middels til lav aktsomhet» er det beregnet at opp til 20% av boligene har radonkonsentrasjoner over 200 Bq/m3, med 70% statistisk sikkerhet. Der hvor det ikke er nok data, eller hvor det ikke er nok statistisk sikkerhet for å beregne aktsomhet for radon, er områder klassifisert som «usikker aktsomhet». Alunskifer er tilknyttet forhøyde radonkonsentrasjoner. Områder hvor det finnes alunskifer er klassifisert som «særlig høy aktsomhet». Med å overføre kunnskap fra områder med inneluftsmålinger til områder uten inneluftsmålinger, er det antatt at radonegenskaper av en geologitype er det samme i hele landet. I praksis kan det forventes noe variasjon i radonegenskaper i polygoner av den samme geologitypen. I tillegg kan det forventes variasjon i radonegenskaper innenfor et polygon.
description: Datasettet viser hvilke områder i Norge som trolig er mer radonutsatt enn andre. Datasettet er basert på geologi og inneluftsmålinger av radon. Inneluftsmålinger er fra NRPA sin nasjonale database, og geologi er fra NGU sine berggrunns- og løsmassedatabaser. Berggrunnsdata er av målestokk 1:250.000 og løsmassedata er av varierende målestokk, fra 1:50.000 til 1:1000.000. Inneluftsmålinger er brukt til å identifisere områder med forhøyd aktsomhet for radon, totalt 34563 geo-refererte målepunkt. De er også brukt til å kjennetegne geologi i forhold til aktsomhet for radon, og denne kunnskapen er overført til områder hvor det finnes ingen eller få inneluftsmålinger. Der hvor et område er klassifisert som «høy aktsomhet» er det beregnet at minst 20% av boligene har radonkonsentrasjoner over 200 Bq/m3, med 70% statistisk sikkerhet. Der hvor et område er klassifisert som «middels til lav aktsomhet» er det beregnet at opp til 20% av boligene har radonkonsentrasjoner over 200 Bq/m3, med 70% statistisk sikkerhet. Der hvor det ikke er nok data, eller hvor det ikke er nok statistisk sikkerhet for å beregne aktsomhet for radon, er områder klassifisert som «usikker aktsomhet». Alunskifer er tilknyttet forhøyde radonkonsentrasjoner. Områder hvor det finnes alunskifer er klassifisert som «særlig høy aktsomhet». Med å overføre kunnskap fra områder med inneluftsmålinger til områder uten inneluftsmålinger, er det antatt at radonegenskaper av en geologitype er det samme i hele landet. I praksis kan det forventes noe variasjon i radonegenskaper i polygoner av den samme geologitypen. I tillegg kan det forventes variasjon i radonegenskaper innenfor et polygon.
status: Sendt inn

Anadrome laksefisk - Strekninger
type: Concept
in scheme: FAIR-register
top concept of: FAIR-register
definition: Datasettet viser samlet utbredelse av anadrome laksefisk (laks, sjøørret og sjørøye) i vassdrag som har bestander av disse. Datasettet har både flate- og linjegeometri. Flatelaget er sammenstilt med utgangspunkt i bestandsflater for hver av de tre aktuelle artene (laks, sjøørret og sjørøye), i målestokk 1:5000. For at datasettet skal brukes effektivt i vannforvaltningen er linjelaget produsert med utgangspunkt i NVEs elvenettverk i målestokk 1:50000. På grunn av dette vil de anadrome strekningene se forskjellig ut i kartet, særlig der det er tale om sideelver/sidebekker. Noen anadrome strekninger vil heller ikke vises i linjelaget. Anadrome laksefisk (laks, sjøørret og sjørøye) finnes i mange vassdrag i landet. Vassdragene i dette datasettet anses å føre anadrome laksefisk. Datasettet omfatter hovedelv, sideelver og innsjøer så langt opp som anadrome laksefisk forekommer. Forvaltningen av anadrome laksefisk er bestandsrettet. I datasettet er begrepet bestand brukt for gruppen individ av samme art som lever innenfor et avgrenset område og som tilhører en felles genetisk gruppe, som oftest ett vassdrag. I noen vassdrag vil det være flere bestander av samme art. Det forekommer anadrome laksefisk i vassdrag som ikke er del av datasettet. Statsforvalteren kan vedta at et vassdrag skal anses for å føre anadrome laksefisk, jf. lakse- og innlandsfiskloven § 31 første ledd, bokstav e. Alle nasjonale laksevassdrag er fullstendig dekket i datasettet. Oppdatering med data for øvrige vassdrag med anadrome laksefisk vil skje fortløpende.
description: Datasettet viser samlet utbredelse av anadrome laksefisk (laks, sjøørret og sjørøye) i vassdrag som har bestander av disse. Datasettet har både flate- og linjegeometri. Flatelaget er sammenstilt med utgangspunkt i bestandsflater for hver av de tre aktuelle artene (laks, sjøørret og sjørøye), i målestokk 1:5000. For at datasettet skal brukes effektivt i vannforvaltningen er linjelaget produsert med utgangspunkt i NVEs elvenettverk i målestokk 1:50000. På grunn av dette vil de anadrome strekningene se forskjellig ut i kartet, særlig der det er tale om sideelver/sidebekker. Noen anadrome strekninger vil heller ikke vises i linjelaget. Anadrome laksefisk (laks, sjøørret og sjørøye) finnes i mange vassdrag i landet. Vassdragene i dette datasettet anses å føre anadrome laksefisk. Datasettet omfatter hovedelv, sideelver og innsjøer så langt opp som anadrome laksefisk forekommer. Forvaltningen av anadrome laksefisk er bestandsrettet. I datasettet er begrepet bestand brukt for gruppen individ av samme art som lever innenfor et avgrenset område og som tilhører en felles genetisk gruppe, som oftest ett vassdrag. I noen vassdrag vil det være flere bestander av samme art. Det forekommer anadrome laksefisk i vassdrag som ikke er del av datasettet. Statsforvalteren kan vedta at et vassdrag skal anses for å føre anadrome laksefisk, jf. lakse- og innlandsfiskloven § 31 første ledd, bokstav e. Alle nasjonale laksevassdrag er fullstendig dekket i datasettet. Oppdatering med data for øvrige vassdrag med anadrome laksefisk vil skje fortløpende.
status: Sendt inn

Trafikkulykker
type: Concept
in scheme: FAIR-register
top concept of: FAIR-register
definition: NVDB Trafikkulykker er et datasett som skal beskrive alle trafikkulykker de siste 5 kalenderårene med personskader eller større materielle skader.
description: NVDB Trafikkulykker er et datasett som skal beskrive alle trafikkulykker de siste 5 kalenderårene med personskader eller større materielle skader.
status: Sendt inn

Flomsoner
type: Concept
in scheme: FAIR-register
top concept of: FAIR-register
definition: Flomsoner viser arealer som oversvømmes ved ulike flomstørrelser (gjentaksintervall). Det blir utarbeidet flomsoner for 20-, 200- og 1000-årsflommene. I områder der klimaendringene gir en forventet økning i vannføringen på mer enn 20 %, utarbeides det flomsone for 200-årsflommen i år 2100.
description: Flomsoner viser arealer som oversvømmes ved ulike flomstørrelser (gjentaksintervall). Det blir utarbeidet flomsoner for 20-, 200- og 1000-årsflommene. I områder der klimaendringene gir en forventet økning i vannføringen på mer enn 20 %, utarbeides det flomsone for 200-årsflommen i år 2100.
status: Sendt inn

Tilgjengelighet
type: Concept
in scheme: FAIR-register
top concept of: FAIR-register
definition: Kartverket kartlegger universell utforming og tilgjengelighet i byer, tettsteder og friluftsområder og offentliggjør alle registrerte data. Kartleggingen viser hvordan stedet er utformet med tanke på fremkommelighet for personer med nedsatt bevegelighet og nedsatt syn. Datasettet er et bidrag til å skape bedre folkehelse og å sikre selvstendighet og sikkerhet for alle mennesker med nedsatt funksjonsevne. Målet med nasjonal kartleggingen er å sikre en enhetlig registrering av tettsteder og frilufts-/friområder over hele landet.
description: Kartverket kartlegger universell utforming og tilgjengelighet i byer, tettsteder og friluftsområder og offentliggjør alle registrerte data. Kartleggingen viser hvordan stedet er utformet med tanke på fremkommelighet for personer med nedsatt bevegelighet og nedsatt syn. Datasettet er et bidrag til å skape bedre folkehelse og å sikre selvstendighet og sikkerhet for alle mennesker med nedsatt funksjonsevne. Målet med nasjonal kartleggingen er å sikre en enhetlig registrering av tettsteder og frilufts-/friområder over hele landet.
status: Sendt inn

Reindrift - Årstidsbeite - Høstvinterbeite
type: Concept
in scheme: FAIR-register
top concept of: FAIR-register
definition: Høstvinterbeite er ett av fem datasett som til sammen beskriver reindriftens årstidsbeiter. Høstvinterbeite beskriver beiteområder for rein i sesongen mellom høst og vinter, og det skilles mellom tidlig høstvinterbeite og spredt brukte høstvinterbeiter. Tidlig høstvinterbeite er de deler av høstvinterområdene som beites tidligst og som ofte pakkes til med snø og blir utilgjengelige for reinen utover vinteren. Beitene kan være utsatt for nedising i perioder hvor været veksler fra mildt til kaldt. Spredt brukte høstvinterbeiter er områder i tilknytning til tidlig høstvinterbeite, og som reinen benytter mer spredt. Reindrift er en nomadisk næring med en syklisk veksling mellom beiter tilpasset reinens krav i den enkelte årstid. Et reindriftsår er inndelt i fem ulike årstider med tilhørende årstidsbeiter. Årlige variasjonene i blant annet vær- og beiteforhold gjør at bruken av årstidsbeitene vil variere i både tid og utstrekning fra år til år.
description: Høstvinterbeite er ett av fem datasett som til sammen beskriver reindriftens årstidsbeiter. Høstvinterbeite beskriver beiteområder for rein i sesongen mellom høst og vinter, og det skilles mellom tidlig høstvinterbeite og spredt brukte høstvinterbeiter. Tidlig høstvinterbeite er de deler av høstvinterområdene som beites tidligst og som ofte pakkes til med snø og blir utilgjengelige for reinen utover vinteren. Beitene kan være utsatt for nedising i perioder hvor været veksler fra mildt til kaldt. Spredt brukte høstvinterbeiter er områder i tilknytning til tidlig høstvinterbeite, og som reinen benytter mer spredt. Reindrift er en nomadisk næring med en syklisk veksling mellom beiter tilpasset reinens krav i den enkelte årstid. Et reindriftsår er inndelt i fem ulike årstider med tilhørende årstidsbeiter. Årlige variasjonene i blant annet vær- og beiteforhold gjør at bruken av årstidsbeitene vil variere i både tid og utstrekning fra år til år.
status: Sendt inn

Naturtyper - verdsatte
type: Concept
in scheme: FAIR-register
top concept of: FAIR-register
definition: Datasettet er tidligere publisert under navnet "Naturtyper -KU-verdi". Datasettet viser naturtypelokaliteter fordelt på verdikategorier i henhold til verdsettingskriteriene i veilederen M-1941 Konsekvensutredninger for klima og miljø. Datasettet viser ikke naturtyper i marint miljø. Som grunnlagsdatasett er benyttet "Naturtyper - Utvalgte", "Naturtyper på land (NiN)" og "Naturtyper på land og i ferskvann (HB13)". Naturtypene kartlagt etter DN-håndbok 13 er, med unntak av lokaliteter som er utvalgte naturtyper, ikke mulig å knytte presist til dagens utvalgskriterier for hvilke naturtyper som kartlegges. Lokalitetene er derfor plassert uten forsøk på å ta hensyn til utvalgskriterier.
description: Datasettet er tidligere publisert under navnet "Naturtyper -KU-verdi". Datasettet viser naturtypelokaliteter fordelt på verdikategorier i henhold til verdsettingskriteriene i veilederen M-1941 Konsekvensutredninger for klima og miljø. Datasettet viser ikke naturtyper i marint miljø. Som grunnlagsdatasett er benyttet "Naturtyper - Utvalgte", "Naturtyper på land (NiN)" og "Naturtyper på land og i ferskvann (HB13)". Naturtypene kartlagt etter DN-håndbok 13 er, med unntak av lokaliteter som er utvalgte naturtyper, ikke mulig å knytte presist til dagens utvalgskriterier for hvilke naturtyper som kartlegges. Lokalitetene er derfor plassert uten forsøk på å ta hensyn til utvalgskriterier.
status: Sendt inn

FKB-Naturinfo
type: Concept
in scheme: FAIR-register
top concept of: FAIR-register
definition: FKB-Naturinfo er en del av Felles Kartdatabase (FKB). FKB er en samling datasett som utgjør en sentral del av grunnkartet. Se metadataoppføring for Felles Kartdatabase for mer info. FKB-Naturinfo beskriver naturinformasjon som ikke faller inn under de andre naturressurskapitlene - konkret hekk, innmålte trær og steiner. FKB-data er ikke-sensistive og åpne data. FKB-dataene er finansiert gjennom Geovekst-samarbeidet, eller kommunene alene for kommuner som står utenfor Geovekst. FKB-dataene er fritt tilgjengelige for Norge digitalt parter og kan lastes ned gjennom nedlastingsløsningen på Geonorge. Private aktører må kjøpe tilgang til dataene gjennom en forhandler.
description: FKB-Naturinfo er en del av Felles Kartdatabase (FKB). FKB er en samling datasett som utgjør en sentral del av grunnkartet. Se metadataoppføring for Felles Kartdatabase for mer info. FKB-Naturinfo beskriver naturinformasjon som ikke faller inn under de andre naturressurskapitlene - konkret hekk, innmålte trær og steiner. FKB-data er ikke-sensistive og åpne data. FKB-dataene er finansiert gjennom Geovekst-samarbeidet, eller kommunene alene for kommuner som står utenfor Geovekst. FKB-dataene er fritt tilgjengelige for Norge digitalt parter og kan lastes ned gjennom nedlastingsløsningen på Geonorge. Private aktører må kjøpe tilgang til dataene gjennom en forhandler.
status: Sendt inn

Arealressurskart - AR50 - Arealtyper
type: Concept
in scheme: FAIR-register
top concept of: FAIR-register
definition: Arealtype er et kartlag eller egenskap med egne presentasjonsregler i det landsdekkende datasettet AR50. Det viser hovedtyper av arealessurser tilpasset bruk i målestokker fra 1:20 000 til 1:100 000. Arealtype er en inndeling i åtte arealressursklasser. Egenskap/kolonne i datasettet som skal brukes til å fremstille kartlaget heter ARTYPE i SOSI-format og arealtype i gml og gdb-format. Lovlige egenskapverdier i henhold til kodelisten er: 10 - Bebygd og samferdsel; 20 - Jordbruksareal; 30 - Skog; 50 - Snaumark; 60 - Myr; 70 - SnøIsbre; 81 - Ferskvann; 82 - Hav; 99 - Ikke kartlagt. For mer informasjon om datasettet AR50, les om Arealressurskart - AR50 Serie på https://kartkatalog.geonorge.no/metadata/arealressurskart-ar50-serie/4bc2d1e0-f693-4bf2-820d-c11830d849a3
description: Arealtype er et kartlag eller egenskap med egne presentasjonsregler i det landsdekkende datasettet AR50. Det viser hovedtyper av arealessurser tilpasset bruk i målestokker fra 1:20 000 til 1:100 000. Arealtype er en inndeling i åtte arealressursklasser. Egenskap/kolonne i datasettet som skal brukes til å fremstille kartlaget heter ARTYPE i SOSI-format og arealtype i gml og gdb-format. Lovlige egenskapverdier i henhold til kodelisten er: 10 - Bebygd og samferdsel; 20 - Jordbruksareal; 30 - Skog; 50 - Snaumark; 60 - Myr; 70 - SnøIsbre; 81 - Ferskvann; 82 - Hav; 99 - Ikke kartlagt. For mer informasjon om datasettet AR50, les om Arealressurskart - AR50 Serie på https://kartkatalog.geonorge.no/metadata/arealressurskart-ar50-serie/4bc2d1e0-f693-4bf2-820d-c11830d849a3
status: Sendt inn

Arter av nasjonal forvaltningsinteresse
type: Concept
in scheme: FAIR-register
top concept of: FAIR-register
definition: Arter av nasjonal forvaltningsinteresse er et forvaltningsrettet datasett som distribueres av Miljødirektoratet, der datafangsten helt og fullt er basert på dataflyten for artsdata som er etablert av Artsdatabanken. Artsdatabanken har, siden etableringen i 2005, etablert dataflyt med relevante institusjoner og relevante databaser som blir synliggjort i Artskart. Eierskapet til data er avklart og ligger hos originalverten. Arter av nasjonal forvaltningsinteresse består både av arter som trenger beskyttelse og arter som er skadelige (fremmede). Alle relevante artsgrupper er omfattet. Beslutning om hvilke arter som inngår er i all hovedsak tatt i henhold til ulike relevante statuser som arter kan befinne seg i. Trua arter, ansvarsarter og freda arter er eksempler på slike statuser, som i datasettet er definert som utvalgskriterier. I tillegg til at det er besluttet hvilke arter som skal inngå, er det besluttet to kvalitetsparametere som må være utfylt eller som må fylle noen minstekrav; geografisk presisjon og funksjon (aktivitet). Disse kravene varierer mellom ulike artsgrupper. Kartlagte forekomster av sensitive funksjonsområder for gitte arter, dvs. forekomster som det ikke skal være allmenn tilgang til detaljert informasjon om, er ikke inkludert i dette datasettet.
description: Arter av nasjonal forvaltningsinteresse er et forvaltningsrettet datasett som distribueres av Miljødirektoratet, der datafangsten helt og fullt er basert på dataflyten for artsdata som er etablert av Artsdatabanken. Artsdatabanken har, siden etableringen i 2005, etablert dataflyt med relevante institusjoner og relevante databaser som blir synliggjort i Artskart. Eierskapet til data er avklart og ligger hos originalverten. Arter av nasjonal forvaltningsinteresse består både av arter som trenger beskyttelse og arter som er skadelige (fremmede). Alle relevante artsgrupper er omfattet. Beslutning om hvilke arter som inngår er i all hovedsak tatt i henhold til ulike relevante statuser som arter kan befinne seg i. Trua arter, ansvarsarter og freda arter er eksempler på slike statuser, som i datasettet er definert som utvalgskriterier. I tillegg til at det er besluttet hvilke arter som skal inngå, er det besluttet to kvalitetsparametere som må være utfylt eller som må fylle noen minstekrav; geografisk presisjon og funksjon (aktivitet). Disse kravene varierer mellom ulike artsgrupper. Kartlagte forekomster av sensitive funksjonsområder for gitte arter, dvs. forekomster som det ikke skal være allmenn tilgang til detaljert informasjon om, er ikke inkludert i dette datasettet.
status: Sendt inn

Grus og pukk
type: Concept
in scheme: FAIR-register
top concept of: FAIR-register
definition: Grus- og Pukkdatabasen ved NGU inneholder opplysninger om de aller fleste grus- og pukkforekomster og uttakssteder i Norge for utnyttelse som råstoff for bygge- og anleggsvirksomhet. Databasen gir også informasjon om arealbruk, volum, kvalitet og hvor viktige ressursene er som råstoff til byggetekniske formål.
description: Grus- og Pukkdatabasen ved NGU inneholder opplysninger om de aller fleste grus- og pukkforekomster og uttakssteder i Norge for utnyttelse som råstoff for bygge- og anleggsvirksomhet. Databasen gir også informasjon om arealbruk, volum, kvalitet og hvor viktige ressursene er som råstoff til byggetekniske formål.
status: Sendt inn

Naturvernområder
type: Concept
in scheme: FAIR-register
top concept of: FAIR-register
definition: Datasettet inneholder verneområder og vernede enkeltobjekt i Norge, herunder Svalbard og Jan Mayen. Verneområder opprettes først og fremst for å bevare naturverdier av nasjonal betydning. Dette er verdier vi skal ta vare på for all overskuelig framtid, også med tanke på naturopplevelse og kunnskap om naturen. Verneområdene forvaltes av fylkesmannen, kommunen, et nasjonalparkstyre eller et interkommunalt verneområdestyre.\\n\\nDatasettet gir en oversikt over hvilke områder som er vernet etter følgende lover:\\n- naturmangfoldloven av 2009\\n- biotopvern etter viltloven av 1981\\n- naturvernloven av 1970\\n- lov om naturvern av 1954\\n- lov om Jan Mayen av 1930\\n- lov om naturfredning av 1910. \\n\\nI tillegg inneholder det områder vernet etter følgende lovverk på Svalbard: \\n- Svalbardloven av 1925\\n- Svalbardmiljøloven av 2002.\\n\\nFor vernevedtak etter 1970 gir datasettet også tilgang til verneforskriften som gjelder for hvert enkelt verneområde.
description: Datasettet inneholder verneområder og vernede enkeltobjekt i Norge, herunder Svalbard og Jan Mayen. Verneområder opprettes først og fremst for å bevare naturverdier av nasjonal betydning. Dette er verdier vi skal ta vare på for all overskuelig framtid, også med tanke på naturopplevelse og kunnskap om naturen. Verneområdene forvaltes av fylkesmannen, kommunen, et nasjonalparkstyre eller et interkommunalt verneområdestyre.\\n\\nDatasettet gir en oversikt over hvilke områder som er vernet etter følgende lover:\\n- naturmangfoldloven av 2009\\n- biotopvern etter viltloven av 1981\\n- naturvernloven av 1970\\n- lov om naturvern av 1954\\n- lov om Jan Mayen av 1930\\n- lov om naturfredning av 1910. \\n\\nI tillegg inneholder det områder vernet etter følgende lovverk på Svalbard: \\n- Svalbardloven av 1925\\n- Svalbardmiljøloven av 2002.\\n\\nFor vernevedtak etter 1970 gir datasettet også tilgang til verneforskriften som gjelder for hvert enkelt verneområde.
status: Sendt inn

Ramsarområder
type: Concept
in scheme: FAIR-register
top concept of: FAIR-register
definition: Datasettet viser norske naturvernområder med status som ramsarområder, under den internasjonale våtmarkskonvensjonen (Ramsarkonvensjonen). Alle norske ramsarområder er vernet som naturvernområder (eget datasett). Noen ganger omfatter ramsarstatusen kun deler av det aktuelle naturvernområdet. Et ramsarområde kan også omfatte areal i flere ulike naturvernområder. I dette datasettet defineres entydig hvilke areal som omfattes av Ramsarkonvensjonen i Norge. I tillegg inneholder det en områdebeskrivelse på norsk, som forklarer om historikk og begrunnelse for at områdene har fått en så viktig internasjonal status.
description: Datasettet viser norske naturvernområder med status som ramsarområder, under den internasjonale våtmarkskonvensjonen (Ramsarkonvensjonen). Alle norske ramsarområder er vernet som naturvernområder (eget datasett). Noen ganger omfatter ramsarstatusen kun deler av det aktuelle naturvernområdet. Et ramsarområde kan også omfatte areal i flere ulike naturvernområder. I dette datasettet defineres entydig hvilke areal som omfattes av Ramsarkonvensjonen i Norge. I tillegg inneholder det en områdebeskrivelse på norsk, som forklarer om historikk og begrunnelse for at områdene har fått en så viktig internasjonal status.
status: Sendt inn

FKB-BygnAnlegg
type: Concept
in scheme: FAIR-register
top concept of: FAIR-register
definition: FKB-BygnAnlegg er en del av Felles Kartdatabase (FKB). FKB er en samling datasett som utgjør en sentral del av grunnkartet. Se metadataoppføring for Felles Kartdatabase for mer info. FKB-BygnAnlegg beskriver bygningsmessige anlegg som ikke er spesifisert i andre fagspesifikke FKB-datasett som FKB-Bygning eller FKB-Veg. Dette inkluderer objekter som murer, gjerder, kaier, moloer, tanker etc. FKB-data er ikke-sensistive og åpne data. FKB-dataene er finansiert gjennom Geovekst-samarbeidet, eller kommunene alene for kommuner som står utenfor Geovekst. FKB-dataene er fritt tilgjengelige for Norge digitalt parter og kan lastes ned gjennom nedlastingsløsningen på Geonorge. Private aktører må kjøpe tilgang til dataene gjennom en forhandler.
description: FKB-BygnAnlegg er en del av Felles Kartdatabase (FKB). FKB er en samling datasett som utgjør en sentral del av grunnkartet. Se metadataoppføring for Felles Kartdatabase for mer info. FKB-BygnAnlegg beskriver bygningsmessige anlegg som ikke er spesifisert i andre fagspesifikke FKB-datasett som FKB-Bygning eller FKB-Veg. Dette inkluderer objekter som murer, gjerder, kaier, moloer, tanker etc. FKB-data er ikke-sensistive og åpne data. FKB-dataene er finansiert gjennom Geovekst-samarbeidet, eller kommunene alene for kommuner som står utenfor Geovekst. FKB-dataene er fritt tilgjengelige for Norge digitalt parter og kan lastes ned gjennom nedlastingsløsningen på Geonorge. Private aktører må kjøpe tilgang til dataene gjennom en forhandler.
status: Sendt inn

Reindrift - Restriksjonsområde
type: Concept
in scheme: FAIR-register
top concept of: FAIR-register
definition: Datasettet avgrenser områder innenfor det samiske reinbeiteområdet hvor retten til å drive reindrift er begrenset på grunn av særlige rettsforhold. Reindriftskartene er utarbeidet som et samarbeid mellom Landbruksdirektoratet, Statsforvalteren og det enkelte reinbeitedistrikt. Reindriftens arealbruk er dynamisk slik at datasettet ikke er fullstendig, men gjenstand for fortløpende revisjon.
description: Datasettet avgrenser områder innenfor det samiske reinbeiteområdet hvor retten til å drive reindrift er begrenset på grunn av særlige rettsforhold. Reindriftskartene er utarbeidet som et samarbeid mellom Landbruksdirektoratet, Statsforvalteren og det enkelte reinbeitedistrikt. Reindriftens arealbruk er dynamisk slik at datasettet ikke er fullstendig, men gjenstand for fortløpende revisjon.
status: Sendt inn

Mulighet for marin leire
type: Concept
in scheme: FAIR-register
top concept of: FAIR-register
definition: Datasettet 'Mulighet for marin leire' (MML) er basert på løsmassekart og datasett for marin grense (MG), og viser hvor det potensielt kan finnes marin leire - enten oppe i dagen eller under andre løsmassetyper. MML leveres kun for områder der løsmasser er kartlagt i målestokk 1:50 000 eller mer detaljert. Det er ikke dekning for MML der løsmasser er kartlagt i grovere målestokk, men marine avsetninger kan likevel forekomme for arealer under marin grense og disse arealene er angitt med rosa farge. MML for nye kvartærgeologiske detaljkart i skala 1:10.000 er ennå ikke inkludert i tjenesten eller nedlasting. I datasettet MML er de kartlagte løsmassetypene under MG klassifisert etter muligheten for å finne marin leire. MML inndeles i svært stor, stor, middels, svært stor men usammenhengende/tynt, liten, stort sett fraværende eller ikke angitt. De ulike klasser er vist i ulike blåtoner/hvit. Blå skravur gis løsmassetyper der lokale/tynne forekomster av marin leire kan forventes. Områdene over MG vises med tynn svart skravur, og disse kan det generelt ses bort fra mht forekomst av marin leire. MML-klassifikasjon gjelder ikke for vanndekte områder under MG. Men marin leire er også vanlig under dagens havnivå både i form av gamle avsetninger og nye, løst lagrede sedimenter som begge kan være en utfordring med hensyn til stabilitet. Selv om løsmasser ikke er kartlagt under vann så er løsmassepolygoner av tekniske årsaker trukket over strandlinjen og ut i sjøen. Dette gjenspeiles i MML-polygonene, og det oppfordres derfor til å legge vannpolygoner over MML. Arealer for mulig marin leire bør alltid sees sammen med arealer for marin grense. Les mer om MG og MML inklusive bruk og usikkerheter på ngu.no under fagområder/kvartærgeologi/marin grense. Les mer om MML samt kartapplikasjon inklusive bruk og usikkerheter ved å trykke på lenken 'Vis produktside' øverst.
description: Datasettet 'Mulighet for marin leire' (MML) er basert på løsmassekart og datasett for marin grense (MG), og viser hvor det potensielt kan finnes marin leire - enten oppe i dagen eller under andre løsmassetyper. MML leveres kun for områder der løsmasser er kartlagt i målestokk 1:50 000 eller mer detaljert. Det er ikke dekning for MML der løsmasser er kartlagt i grovere målestokk, men marine avsetninger kan likevel forekomme for arealer under marin grense og disse arealene er angitt med rosa farge. MML for nye kvartærgeologiske detaljkart i skala 1:10.000 er ennå ikke inkludert i tjenesten eller nedlasting. I datasettet MML er de kartlagte løsmassetypene under MG klassifisert etter muligheten for å finne marin leire. MML inndeles i svært stor, stor, middels, svært stor men usammenhengende/tynt, liten, stort sett fraværende eller ikke angitt. De ulike klasser er vist i ulike blåtoner/hvit. Blå skravur gis løsmassetyper der lokale/tynne forekomster av marin leire kan forventes. Områdene over MG vises med tynn svart skravur, og disse kan det generelt ses bort fra mht forekomst av marin leire. MML-klassifikasjon gjelder ikke for vanndekte områder under MG. Men marin leire er også vanlig under dagens havnivå både i form av gamle avsetninger og nye, løst lagrede sedimenter som begge kan være en utfordring med hensyn til stabilitet. Selv om løsmasser ikke er kartlagt under vann så er løsmassepolygoner av tekniske årsaker trukket over strandlinjen og ut i sjøen. Dette gjenspeiles i MML-polygonene, og det oppfordres derfor til å legge vannpolygoner over MML. Arealer for mulig marin leire bør alltid sees sammen med arealer for marin grense. Les mer om MG og MML inklusive bruk og usikkerheter på ngu.no under fagområder/kvartærgeologi/marin grense. Les mer om MML samt kartapplikasjon inklusive bruk og usikkerheter ved å trykke på lenken 'Vis produktside' øverst.
status: Sendt inn

Storulykkeanlegg
type: Concept
in scheme: FAIR-register
top concept of: FAIR-register
definition: Datasettet viser alle anlegg i Norge som faller inn under storulykkeforskriften (forskrift om tiltak for å forebygge og begrense skadevirkningene av storulykker i virksomheter der farlige kjemikalier forekommer). Om lag 350 norske virksomheter er regulert av storulykkeforskriften. Dette er i stor grad prosessindustri, kjemisk industri, tankanlegg og eksplosivlagre. Storulykkeforskriften implementerer de kravene som stilles til virksomheter gjennom EU-direktivet Seveso III, og håndheves av følgende myndigheter: Miljødirektoratet, Direktoratet for Arbeidstilsynet, Direktoratet for samfunnssikkerhet og beredskap (DSB), Petroleumstilsynet og Næringslivets sikkerhetsorganisasjon. Datasettet gis bare ut til bruk i kommunal og regional beredskap, arealplanlegging og byggesaksbehandling og bare ved direkte henvendelse til DSB ved kart@dsb.no. På grunn av restriksjonene på dataene er de bare tilgjengelige for utvalgte brukere. Dette vil være brukere innenfor arealplanlegging, byggesaksbehandling og samfunnssikkerhet/beredskap.
description: Datasettet viser alle anlegg i Norge som faller inn under storulykkeforskriften (forskrift om tiltak for å forebygge og begrense skadevirkningene av storulykker i virksomheter der farlige kjemikalier forekommer). Om lag 350 norske virksomheter er regulert av storulykkeforskriften. Dette er i stor grad prosessindustri, kjemisk industri, tankanlegg og eksplosivlagre. Storulykkeforskriften implementerer de kravene som stilles til virksomheter gjennom EU-direktivet Seveso III, og håndheves av følgende myndigheter: Miljødirektoratet, Direktoratet for Arbeidstilsynet, Direktoratet for samfunnssikkerhet og beredskap (DSB), Petroleumstilsynet og Næringslivets sikkerhetsorganisasjon. Datasettet gis bare ut til bruk i kommunal og regional beredskap, arealplanlegging og byggesaksbehandling og bare ved direkte henvendelse til DSB ved kart@dsb.no. På grunn av restriksjonene på dataene er de bare tilgjengelige for utvalgte brukere. Dette vil være brukere innenfor arealplanlegging, byggesaksbehandling og samfunnssikkerhet/beredskap.
status: Sendt inn

Kvikkleire
type: Concept
in scheme: FAIR-register
top concept of: FAIR-register
definition: Kartene gir en oversikt over soner med potensiell fare (aktsomhetsområder) for større kvikkleireskred. Sonene er identifisert og avgrenset ved kvartærgeologisk kartlegging (for å identifisere områder med marin leire), geoteknisk vurdering av topografi og grove, geotekniske undersøkelser. Sonene omfatter løsneområder for kvikkleireskred (områder som kan gli ut) og utløpsområder (områder som kan rammes av skredmasser) for nye kartlegginger. For identifiserte soner som kun inneholder løsneområder, må utløpsområdene vurderes særskilt.\\nDe identifiserte kvikkleiresonene er klassifisert i tre faregradsklasser (høy-, middels- og lav faregrad), basert på topografiske, geotekniske og hydrologiske kriterier. Sonene er videre klassifisert i tre konsekvensklasser(høy-, middels- og lav konsekvensklasse) avhengig av konsekvenser som et skred i sonen vil ha på bebyggelse og infrastruktur. Sonene er deretter klassifisert i fem risikoklasser, utledet fra faregrads- og konsekvensklassifiseringen.
description: Kartene gir en oversikt over soner med potensiell fare (aktsomhetsområder) for større kvikkleireskred. Sonene er identifisert og avgrenset ved kvartærgeologisk kartlegging (for å identifisere områder med marin leire), geoteknisk vurdering av topografi og grove, geotekniske undersøkelser. Sonene omfatter løsneområder for kvikkleireskred (områder som kan gli ut) og utløpsområder (områder som kan rammes av skredmasser) for nye kartlegginger. For identifiserte soner som kun inneholder løsneområder, må utløpsområdene vurderes særskilt.\\nDe identifiserte kvikkleiresonene er klassifisert i tre faregradsklasser (høy-, middels- og lav faregrad), basert på topografiske, geotekniske og hydrologiske kriterier. Sonene er videre klassifisert i tre konsekvensklasser(høy-, middels- og lav konsekvensklasse) avhengig av konsekvenser som et skred i sonen vil ha på bebyggelse og infrastruktur. Sonene er deretter klassifisert i fem risikoklasser, utledet fra faregrads- og konsekvensklassifiseringen.
status: Sendt inn

Reindrift - Årstidsbeite - Vårbeite
type: Concept
in scheme: FAIR-register
top concept of: FAIR-register
definition: Vårbeite er ett av fem datasett som til sammen beskriver reindriftens årstidsbeiter. Det skilles mellom to typer vårbeite: kalvingsland og oksebeiteland. Kalvingsland er de deler av vårområdet som beites tidligst og hvor hoveddelen av simleflokken oppholder seg før kalving, under kalving og i pregningsperioden. Pregningsperioden er tiden etter kalving og frem til simler med kalv samler seg i større flokker, såkalte fostringsflokker. Oksebeiteland er områder hvor okserein, fjorårskalver og simler som ikke skal kalve oppholder seg i kalvingstida. Reindrift er en nomadisk næring med en syklisk veksling mellom beiter tilpasset reinens krav i den enkelte årstid. Et reindriftsår er inndelt i fem ulike årstider med tilhørende årstidsbeiter. Årlige variasjonene i blant annet vær- og beiteforhold gjør at bruken av årstidsbeitene vil variere i både tid og utstrekning fra år til år.
description: Vårbeite er ett av fem datasett som til sammen beskriver reindriftens årstidsbeiter. Det skilles mellom to typer vårbeite: kalvingsland og oksebeiteland. Kalvingsland er de deler av vårområdet som beites tidligst og hvor hoveddelen av simleflokken oppholder seg før kalving, under kalving og i pregningsperioden. Pregningsperioden er tiden etter kalving og frem til simler med kalv samler seg i større flokker, såkalte fostringsflokker. Oksebeiteland er områder hvor okserein, fjorårskalver og simler som ikke skal kalve oppholder seg i kalvingstida. Reindrift er en nomadisk næring med en syklisk veksling mellom beiter tilpasset reinens krav i den enkelte årstid. Et reindriftsår er inndelt i fem ulike årstider med tilhørende årstidsbeiter. Årlige variasjonene i blant annet vær- og beiteforhold gjør at bruken av årstidsbeitene vil variere i både tid og utstrekning fra år til år.
status: Sendt inn

Matrikkelen, Norges offisielle eiendomsregister
type: Concept
in scheme: FAIR-register
top concept of: FAIR-register
definition: Matrikkelen er Norges offisielle register over fast eiendom, herunder bygninger, boliger/bruksenheter og offisielle adresser. Matrikkelen er regulert av matrikkelloven som trådte i kraft 1.1.2010 og erstattet den tidligere delingsloven. Matrikkelen inkluderer også data fra tinglysingen, folkeregisteret, enhetsregisteret, grunnforurensing og kulturminner.
description: Matrikkelen er Norges offisielle register over fast eiendom, herunder bygninger, boliger/bruksenheter og offisielle adresser. Matrikkelen er regulert av matrikkelloven som trådte i kraft 1.1.2010 og erstattet den tidligere delingsloven. Matrikkelen inkluderer også data fra tinglysingen, folkeregisteret, enhetsregisteret, grunnforurensing og kulturminner.
status: Sendt inn

Navigasjonsinstallasjon
type: Concept
in scheme: FAIR-register
top concept of: FAIR-register
definition: Kystverket administrerer et system av innretninger for navigasjonsveiledning i Norge. Dette systemet består av innretninger drevet av Kystverket, innretninger drevet av kommunale havner og private innretninger drevet av andre. Innretninger for navigasjonsveiledning gir visuelle og elektroniske signaler som er lagt til rette for å være til hjelp i navigasjonsprosessen for aktsomme sjøfarende. Det er imidlertid ikke hensikten å gjøre det mulig for sjøfarende å identifisere enhver båe eller grunne eller hindring for sjøtrafikken som finnes i norske farvann som ellers er farbare for skip. Derimot skal Kystverket sørge for en fornuftig merking av farvannet i den utstrekning som ressursene tillater.
description: Kystverket administrerer et system av innretninger for navigasjonsveiledning i Norge. Dette systemet består av innretninger drevet av Kystverket, innretninger drevet av kommunale havner og private innretninger drevet av andre. Innretninger for navigasjonsveiledning gir visuelle og elektroniske signaler som er lagt til rette for å være til hjelp i navigasjonsprosessen for aktsomme sjøfarende. Det er imidlertid ikke hensikten å gjøre det mulig for sjøfarende å identifisere enhver båe eller grunne eller hindring for sjøtrafikken som finnes i norske farvann som ellers er farbare for skip. Derimot skal Kystverket sørge for en fornuftig merking av farvannet i den utstrekning som ressursene tillater.
status: Sendt inn

FKB-Veg
type: Concept
in scheme: FAIR-register
top concept of: FAIR-register
definition: FKB-Veg er en del av Felles Kartdatabase (FKB). FKB er en samling datasett som utgjør en sentral del av grunnkartet. Se metadataoppføring for Felles Kartdatabase for mer info. FKB-Veg inneholder detaljert informasjon om alle offentlige og private veganlegg. Spesifikasjonen gjelder for de enkelte vegelementene som beskriver veglegemets geometri. Dataene omfatter beskrivelse av alle typer veger for kjørende, syklende og gående samt et utvalg av tilhørende objekter og avgrensninger. FKB-data er ikke-sensistive og åpne data. FKB-dataene er finansiert gjennom Geovekst-samarbeidet, eller kommunene alene for kommuner som står utenfor Geovekst. FKB-dataene er fritt tilgjengelige for Norge digitalt parter og kan lastes ned gjennom nedlastingsløsningen på Geonorge. Private aktører må kjøpe tilgang til dataene gjennom en forhandler.
description: FKB-Veg er en del av Felles Kartdatabase (FKB). FKB er en samling datasett som utgjør en sentral del av grunnkartet. Se metadataoppføring for Felles Kartdatabase for mer info. FKB-Veg inneholder detaljert informasjon om alle offentlige og private veganlegg. Spesifikasjonen gjelder for de enkelte vegelementene som beskriver veglegemets geometri. Dataene omfatter beskrivelse av alle typer veger for kjørende, syklende og gående samt et utvalg av tilhørende objekter og avgrensninger. FKB-data er ikke-sensistive og åpne data. FKB-dataene er finansiert gjennom Geovekst-samarbeidet, eller kommunene alene for kommuner som står utenfor Geovekst. FKB-dataene er fritt tilgjengelige for Norge digitalt parter og kan lastes ned gjennom nedlastingsløsningen på Geonorge. Private aktører må kjøpe tilgang til dataene gjennom en forhandler.
status: Sendt inn

Sjøkart - raster Hovedkart
type: Concept
in scheme: FAIR-register
top concept of: FAIR-register
definition: Hovedkartserien dekker norske kysten fra svenskegrensen til Grense-Jakobselv. Hovedkartene består av 143 sjøkart i målestokk 1:50 000 (med noen få unntak). De er ofte utstyrt med kartutsnitt (spesialer) i større målestokker over trange farvann og havner. Hovedkartserien er først og fremst et navigasjonskart for kyststrøkene.
description: Hovedkartserien dekker norske kysten fra svenskegrensen til Grense-Jakobselv. Hovedkartene består av 143 sjøkart i målestokk 1:50 000 (med noen få unntak). De er ofte utstyrt med kartutsnitt (spesialer) i større målestokker over trange farvann og havner. Hovedkartserien er først og fremst et navigasjonskart for kyststrøkene.
status: Sendt inn

Barnetråkk - aggregert
type: Concept
in scheme: FAIR-register
top concept of: FAIR-register
definition: Barnetråkk inneholder data om barna sitt nærmiljø og er registrert av skoleelever. Data omfatter veier barn bruker til skole- og fritidsaktiviteter, samt informasjon om steder barn bruker til fritidsaktiviteter. Det registreres også steder barn liker eller misliker. Datasettet gir nyttig informasjon til bruk i kommunal og regional planlegging, statistikk, forskning og utdanning. Aggregert datasett er en forenklet versjon av "Barnetråkk - fullstendig" og brukes til representasjon av punkt- og linje data fra fullstendig datasett i heksagongrid. Datasettet Barnetråkk - aggregert er offentlig tilgjengelig uten behov til innlogging med 200 meter oppløsning, mens fullstendig datasett og aggregert datasettet med mindre enn 200 meter oppløsning kun er tilgjengelig for autoriserte og registrerte brukere gjennom innlogging hos UiB.
description: Barnetråkk inneholder data om barna sitt nærmiljø og er registrert av skoleelever. Data omfatter veier barn bruker til skole- og fritidsaktiviteter, samt informasjon om steder barn bruker til fritidsaktiviteter. Det registreres også steder barn liker eller misliker. Datasettet gir nyttig informasjon til bruk i kommunal og regional planlegging, statistikk, forskning og utdanning. Aggregert datasett er en forenklet versjon av "Barnetråkk - fullstendig" og brukes til representasjon av punkt- og linje data fra fullstendig datasett i heksagongrid. Datasettet Barnetråkk - aggregert er offentlig tilgjengelig uten behov til innlogging med 200 meter oppløsning, mens fullstendig datasett og aggregert datasettet med mindre enn 200 meter oppløsning kun er tilgjengelig for autoriserte og registrerte brukere gjennom innlogging hos UiB.
status: Sendt inn

Nasjonal database for grunnundersøkelser (NADAG)
type: Concept
in scheme: FAIR-register
top concept of: FAIR-register
definition: NGU har utviklet Nasjonal database for grunnundersøkelser (NADAG) med tilhørende karttjenester og muligheter for innmelding og nedlasting av data fra geotekniske undersøkelser. Fra og med 2025 er det lovfestet plikt for innmelding av komplette geotekniske grunnundersøkelser til NADAG. Eldre data har stor nytteverdi, og ønskes også meldt inn. Prosjektet for utvikling av NADAG er et samarbeid mellom NGU og etatene Statens vegvesen, Bane NOR, og Norges vassdrags- og energidirektorat (NVE). NGU samarbeider også med ulike konsulenter i utviklingen av løsningene. Punktene i NADAGs kartinnsyn representerer geotekniske borehull (GB), hvor metadata vises (f.eks. boretype, oppdragsfirma, oppdragsgiver, stedfestelse (posisjon), boret dybde, ev. dyp til berg). For noen punkter vil mer informasjon være tilgjengelig (f.eks. lenke til rapport og ev. rådata, boreprofil og måleresultater). NADAGs datamodell er basert på en datastruktur beskrevet i SOSI-standardene for Geovitenskapelige undersøkelser og Geotekniske undersøkelser. NADAG er innlemmet i listen over datasett til DOK. Visningstjenesten til NADAG har to innsynsløsninger, der «Mobilvennlig versjon» ligner de andre kartinnsynene til NGU, mens «NADAG fullversjon» har litt annet oppsett og andre verktøy. Nye data skal leveres komplett til NADAG, enten ved bruk av GeoSuite toolbox eller gjennom et innmeldings-API som er under utarbeidelse. Eldre data kan alternativt leveres gjennom NADAG WebReg. NADAG er landsdekkende. Alle data som ligger i NADAG er fritt tilgjengelig for alle, og lastes ned vederlagsfritt. Det vil være varierende mengde informasjon tilhørende hvert datapunkt, noe som vil avhenge blant annet av formatet data er levert på, og dataeiers vilje til å offentliggjøre data utover kun å vise metadata. Tilgjengelige rapporter (pdf) kan lastes ned fra NADAGs infoark. Data kan lastes ned på formatene GML, Filgeodatabase og GeoSuite. I tillegg kan man benytte NADAGs WMS, samt at det arbeides med lese-API (OGC API Features…
description: NGU har utviklet Nasjonal database for grunnundersøkelser (NADAG) med tilhørende karttjenester og muligheter for innmelding og nedlasting av data fra geotekniske undersøkelser. Fra og med 2025 er det lovfestet plikt for innmelding av komplette geotekniske grunnundersøkelser til NADAG. Eldre data har stor nytteverdi, og ønskes også meldt inn. Prosjektet for utvikling av NADAG er et samarbeid mellom NGU og etatene Statens vegvesen, Bane NOR, og Norges vassdrags- og energidirektorat (NVE). NGU samarbeider også med ulike konsulenter i utviklingen av løsningene. Punktene i NADAGs kartinnsyn representerer geotekniske borehull (GB), hvor metadata vises (f.eks. boretype, oppdragsfirma, oppdragsgiver, stedfestelse (posisjon), boret dybde, ev. dyp til berg). For noen punkter vil mer informasjon være tilgjengelig (f.eks. lenke til rapport og ev. rådata, boreprofil og måleresultater). NADAGs datamodell er basert på en datastruktur beskrevet i SOSI-standardene for Geovitenskapelige undersøkelser og Geotekniske undersøkelser. NADAG er innlemmet i listen over datasett til DOK. Visningstjenesten til NADAG har to innsynsløsninger, der «Mobilvennlig versjon» ligner de andre kartinnsynene til NGU, mens «NADAG fullversjon» har litt annet oppsett og andre verktøy. Nye data skal leveres komplett til NADAG, enten ved bruk av GeoSuite toolbox eller gjennom et innmeldings-API som er under utarbeidelse. Eldre data kan alternativt leveres gjennom NADAG WebReg. NADAG er landsdekkende. Alle data som ligger i NADAG er fritt tilgjengelig for alle, og lastes ned vederlagsfritt. Det vil være varierende mengde informasjon tilhørende hvert datapunkt, noe som vil avhenge blant annet av formatet data er levert på, og dataeiers vilje til å offentliggjøre data utover kun å vise metadata. Tilgjengelige rapporter (pdf) kan lastes ned fra NADAGs infoark. Data kan lastes ned på formatene GML, Filgeodatabase og GeoSuite. I tillegg kan man benytte NADAGs WMS, samt at det arbeides med lese-API (OGC API Features…
status: Sendt inn

Støysoner for Forsvarets flyplasser
type: Concept
in scheme: FAIR-register
top concept of: FAIR-register
definition: Støysoner for Forsvarets flyplasser
description: Støysoner for Forsvarets flyplasser
status: Sendt inn

Matrikkelen - Eiendomskart Teig
type: Concept
in scheme: FAIR-register
top concept of: FAIR-register
definition: Datasettet Matrikkelen-Eiendomskart Teig inneholder et utdrag av eiendomsinformasjon som er registrert i Matrikkelen, Norges offisielle register over fast eiendom. Datasettet inneholder teiger (avgrensede arealer/jordstykker) med informasjon om hvilken eiendom (matrikkelenhet) de tilhører. Matrikkelnummeret (kommunenummer-gårdsnummer/bruksnummer eventulet festenummer, seksjonsnummer) identifiserer eiendommen og ligger til datatypen Matrikkelenhet. Matrikkelenhet inneholder også andre nøkkelopplysninger og "varsel-flagg" om eiendommen. Grensepunkt, grenser og teigareal med kvalitetsopplysninger er med i datasettet. Volumer til anleggseiendommer (eiendommer over/under bakken) leveres som et areal, - et plant "fotavtrykk", men oppgittVolum kan være registrert. I tillegg fins ulike id-er for enklere gjenfinning og koblinger (lokal id eller universell uuid). Matrikkelen-Eiendomskart Teig inneholder data som er fritt tilgjengelig for alle (åpne data). Produktet Matrikkelen-Bygningspunkt inneholder id-er for kobling mellom Adresse, Bygning og Eiendom. Distribusjonen er satt opp mot en distribusjonsløsning som gir noe forsinkelse fra Matrikkelsystemet, - fra 30 minutters forsinkelse ved nedlasting av data i fritt valgt område fra kart, daglig for WMS og WFS, ukentlige for nedlasting av ferdiglagde filer og databaser (ny fil kun hvis det er skjedd endringer i Matrikkelen). Ved større endringer/lastinger kan forsinkelsen være større.
description: Datasettet Matrikkelen-Eiendomskart Teig inneholder et utdrag av eiendomsinformasjon som er registrert i Matrikkelen, Norges offisielle register over fast eiendom. Datasettet inneholder teiger (avgrensede arealer/jordstykker) med informasjon om hvilken eiendom (matrikkelenhet) de tilhører. Matrikkelnummeret (kommunenummer-gårdsnummer/bruksnummer eventulet festenummer, seksjonsnummer) identifiserer eiendommen og ligger til datatypen Matrikkelenhet. Matrikkelenhet inneholder også andre nøkkelopplysninger og "varsel-flagg" om eiendommen. Grensepunkt, grenser og teigareal med kvalitetsopplysninger er med i datasettet. Volumer til anleggseiendommer (eiendommer over/under bakken) leveres som et areal, - et plant "fotavtrykk", men oppgittVolum kan være registrert. I tillegg fins ulike id-er for enklere gjenfinning og koblinger (lokal id eller universell uuid). Matrikkelen-Eiendomskart Teig inneholder data som er fritt tilgjengelig for alle (åpne data). Produktet Matrikkelen-Bygningspunkt inneholder id-er for kobling mellom Adresse, Bygning og Eiendom. Distribusjonen er satt opp mot en distribusjonsløsning som gir noe forsinkelse fra Matrikkelsystemet, - fra 30 minutters forsinkelse ved nedlasting av data i fritt valgt område fra kart, daglig for WMS og WFS, ukentlige for nedlasting av ferdiglagde filer og databaser (ny fil kun hvis det er skjedd endringer i Matrikkelen). Ved større endringer/lastinger kan forsinkelsen være større.
status: Sendt inn

Turrutebasen
type: Concept
in scheme: FAIR-register
top concept of: FAIR-register
definition: Landsdekkende datasett som viser turruter. Datasettet inneholder fotruter, skiløyper, sykkelruter, andre turruter og tilretteleggingstiltak i friluftslivsområder. Dataene kan brukes i prosesser etter plan- og bygningsloven (kommuneplanlegging og saksbehandlingsom for eksempel byggesak) i kommunene, til analyser, rapportering, oppslag og visualisering av turruter til turplanlegging.
description: Landsdekkende datasett som viser turruter. Datasettet inneholder fotruter, skiløyper, sykkelruter, andre turruter og tilretteleggingstiltak i friluftslivsområder. Dataene kan brukes i prosesser etter plan- og bygningsloven (kommuneplanlegging og saksbehandlingsom for eksempel byggesak) i kommunene, til analyser, rapportering, oppslag og visualisering av turruter til turplanlegging.
status: Sendt inn

Reindrift - Ekspropriasjonsområde
type: Concept
in scheme: FAIR-register
top concept of: FAIR-register
definition: Datasettet ekspropriasjonsområde avgrenser områder som staten har ekspropriert for at det skal kunne utøves reindrift.
description: Datasettet ekspropriasjonsområde avgrenser områder som staten har ekspropriert for at det skal kunne utøves reindrift.
status: Sendt inn

Barmarksløyper i Finnmark
type: Concept
in scheme: FAIR-register
top concept of: FAIR-register
definition: Data knyttet til motorisert ferdsel i utmark. Data over vedtatte og dermed lovlig ruter for terrengkjøretøy sommerstid. Grunnlag for vedtak er lov om motorferdsel i utmark og håndteres av fylkesmannen, eventuelt andre vedtak i kommunen. Motorisert ferdsel i utmark. Gjelder spesifiserte ruter for terrengkjøretøy sommerstid.
description: Data knyttet til motorisert ferdsel i utmark. Data over vedtatte og dermed lovlig ruter for terrengkjøretøy sommerstid. Grunnlag for vedtak er lov om motorferdsel i utmark og håndteres av fylkesmannen, eventuelt andre vedtak i kommunen. Motorisert ferdsel i utmark. Gjelder spesifiserte ruter for terrengkjøretøy sommerstid.
status: Sendt inn

Sjøkart - Dybdedata
type: Concept
in scheme: FAIR-register
top concept of: FAIR-register
definition: Datasettet inneholder ugraderte vektoriserte dybdedata til fri bruk. De er enkelt tilgjengelige for innsyn på www.norgeskart.no. Dybdeinformasjonen er referert til sjøkartnull (EPSG 9672). Kystkontur, konstruert kyst og skjær er referert til middel høyvann. Dybdedata gjelder kun saltvann. Dybdedataene er et DOK datasett. Dybdedataene er grunnlag for Kartverkets navigasjonsprodukter og tjenester. Dybdedataene forvaltes i sjødivisjonens maritime primærdatabase. Databasen inneholder sjømålingsdata av forskjellig alder og kvalitet som er sammenstilt til et sømløst vektorisert datasett. Datasettet oppdateres kontinuerlig. Datasettet er ugradert og oppløsning på tetthet mellom dybdepunkt er i henhold til graderingsregimet og gjeldende lovverk om skjermingsverdig informasjon (dvs. 50 m mellom dybdepunktene). Kurveintervallet er: 2, 5, 10, 15, 20, 30, 40, 50, 100, 150, 200, 250, osv. Noen havner har tettere kurveintervall i intervallet 0-30 m (kurver for hver meter). Områder som ikke er sjømålt er også beskrevet i dette datsettet. Datasettet er grunnlag for offisielle sjøkart og navigasjonsprodukt, men er ikke et navigasjonsprodukt. Datasettet er også tilgjengelig som WMS og WFS-tjeneste. Det finnes en egen WMS-tjeneste som viser datakvalitet på dybdemålingene.
description: Datasettet inneholder ugraderte vektoriserte dybdedata til fri bruk. De er enkelt tilgjengelige for innsyn på www.norgeskart.no. Dybdeinformasjonen er referert til sjøkartnull (EPSG 9672). Kystkontur, konstruert kyst og skjær er referert til middel høyvann. Dybdedata gjelder kun saltvann. Dybdedataene er et DOK datasett. Dybdedataene er grunnlag for Kartverkets navigasjonsprodukter og tjenester. Dybdedataene forvaltes i sjødivisjonens maritime primærdatabase. Databasen inneholder sjømålingsdata av forskjellig alder og kvalitet som er sammenstilt til et sømløst vektorisert datasett. Datasettet oppdateres kontinuerlig. Datasettet er ugradert og oppløsning på tetthet mellom dybdepunkt er i henhold til graderingsregimet og gjeldende lovverk om skjermingsverdig informasjon (dvs. 50 m mellom dybdepunktene). Kurveintervallet er: 2, 5, 10, 15, 20, 30, 40, 50, 100, 150, 200, 250, osv. Noen havner har tettere kurveintervall i intervallet 0-30 m (kurver for hver meter). Områder som ikke er sjømålt er også beskrevet i dette datsettet. Datasettet er grunnlag for offisielle sjøkart og navigasjonsprodukt, men er ikke et navigasjonsprodukt. Datasettet er også tilgjengelig som WMS og WFS-tjeneste. Det finnes en egen WMS-tjeneste som viser datakvalitet på dybdemålingene.
status: Sendt inn

Skredhendelser
type: Concept
in scheme: FAIR-register
top concept of: FAIR-register
definition: Datasettet gir en oversikt over registrerte skredhendelser i Norge, og kalles også for den nasjonale skredhendelsesdatabasen (NSDB). NSDB driftes av NVE og inneholder over 100 000 registrerte skredhendelser. Målet for NSDB er å samle skredregistreringer fra forskjellige kilder i én nasjonal database. Statens vegvesen står for størstedelen av skredregistreringene i databasen, men det er også mange skred registrert av Bane NOR, NGI, NGU, NVE og andre personer. De siste årene har antall registreringer økt betraktelig, men databasen inneholder også mange større historiske skredhendelser, spesielt knyttet til dødsulykker. Alle skredhendelser registrert via Varsom Regobs eller Skredregistrering.no ender opp i NSDB.
description: Datasettet gir en oversikt over registrerte skredhendelser i Norge, og kalles også for den nasjonale skredhendelsesdatabasen (NSDB). NSDB driftes av NVE og inneholder over 100 000 registrerte skredhendelser. Målet for NSDB er å samle skredregistreringer fra forskjellige kilder i én nasjonal database. Statens vegvesen står for størstedelen av skredregistreringene i databasen, men det er også mange skred registrert av Bane NOR, NGI, NGU, NVE og andre personer. De siste årene har antall registreringer økt betraktelig, men databasen inneholder også mange større historiske skredhendelser, spesielt knyttet til dødsulykker. Alle skredhendelser registrert via Varsom Regobs eller Skredregistrering.no ender opp i NSDB.
status: Sendt inn

Tettsteder 2025
type: Concept
in scheme: FAIR-register
top concept of: FAIR-register
definition: Datasettet viser Tettsteder pr. 01.01.2025. Tettsteder er geografiske områder som har en dynamisk avgrensing, og antall tettsteder og deres yttergrenser vil endre seg over tid avhengig av byggeaktivitet og befolkningsutvikling. Et tettsted er en hussamling med minst 200 bosatte og der avstanden mellom husene normalt ikke skal overstige 50 meter. Les mer om tettsted, fullstendig definisjon og tilhørende statistikk på produktsiden her: https://www.ssb.no/befolkning/folketall/statistikk/tettsteders-befolkning-og-areal. Dataene tilgjengelig for innsyn og nedlasting fra Geonorge og fra SSBs kartportal Kart.ssb.no
description: Datasettet viser Tettsteder pr. 01.01.2025. Tettsteder er geografiske områder som har en dynamisk avgrensing, og antall tettsteder og deres yttergrenser vil endre seg over tid avhengig av byggeaktivitet og befolkningsutvikling. Et tettsted er en hussamling med minst 200 bosatte og der avstanden mellom husene normalt ikke skal overstige 50 meter. Les mer om tettsted, fullstendig definisjon og tilhørende statistikk på produktsiden her: https://www.ssb.no/befolkning/folketall/statistikk/tettsteders-befolkning-og-areal. Dataene tilgjengelig for innsyn og nedlasting fra Geonorge og fra SSBs kartportal Kart.ssb.no
status: Sendt inn

N5 Kartdata
type: Concept
in scheme: FAIR-register
top concept of: FAIR-register
definition: Informasjon tilsvarende digitalt ØK. N5 Kartdata er basert på utvalgte, generaliserte FKB data. Temagrupper: Høyde: Høydekurver, 5 m ekv. og høydepunkt. Vann: Kyst, sjø, innsjø og vassdrag. Administrative grenser: Administrasjonsgrenser, eiendomsinformasjon, servituttgrenser, verneområder og kulturminner. Markslag: Markslaginformasjon. Areal: Arealbruk. Bygg og anlegg: Bygninger, bygningsmessige anlegg og ledninger. Samferdsel: Vegsituasjon, jernbane, annen samferdsel og flyplass. Tekst: Presentasjonsdata. Dekning: Dekningen varierer, avhengig av hvor det har vært gjennomført Geovekst - prosjekter. For informasjon om dekning ta kontakt med det lokale fylkeskartkontor
description: Informasjon tilsvarende digitalt ØK. N5 Kartdata er basert på utvalgte, generaliserte FKB data. Temagrupper: Høyde: Høydekurver, 5 m ekv. og høydepunkt. Vann: Kyst, sjø, innsjø og vassdrag. Administrative grenser: Administrasjonsgrenser, eiendomsinformasjon, servituttgrenser, verneområder og kulturminner. Markslag: Markslaginformasjon. Areal: Arealbruk. Bygg og anlegg: Bygninger, bygningsmessige anlegg og ledninger. Samferdsel: Vegsituasjon, jernbane, annen samferdsel og flyplass. Tekst: Presentasjonsdata. Dekning: Dekningen varierer, avhengig av hvor det har vært gjennomført Geovekst - prosjekter. For informasjon om dekning ta kontakt med det lokale fylkeskartkontor
status: Sendt inn

Støykartlegging veg etter T-1442
type: Concept
in scheme: FAIR-register
top concept of: FAIR-register
definition: Denne tjenesten inneholder Støyvarselkart etter T-1442. Støyvarselkartene er utarbeidet etter Retningslinje for behandling av støy i arealplanlegging (T-1442). Støyvarselkartene viser beregnet rød (Lden>65dB) og gul (Lden>55dB) støysone langs riks- og fylkesveg. Støyvarselkartene fra Statens vegvesen viser en prognosesituasjon 15–20 år fram i tid. Det vil si at trafikkvolum (ÅDT), som er en av de viktigste parameterne i støyberegningsmodellen, er fremskrevet (basert på prognoser) til oppgitt beregningsår. Beregningshøyden er 4 meter. Kartleggingene er gjennomført med Statens vegvesens beregningsverktøy NorStøy. Beregningsmetode er Nord2000Road. Data om vegene og trafikken hentes fra Nasjonal vegdatabank (NVDB). De viktigste parameterne er ÅDT, tungtrafikkandel og hastighet. Kartdata hentes fra felles kartdatabasen (FKB). Informasjon om bygninger hentes fra matrikkelen.
description: Denne tjenesten inneholder Støyvarselkart etter T-1442. Støyvarselkartene er utarbeidet etter Retningslinje for behandling av støy i arealplanlegging (T-1442). Støyvarselkartene viser beregnet rød (Lden>65dB) og gul (Lden>55dB) støysone langs riks- og fylkesveg. Støyvarselkartene fra Statens vegvesen viser en prognosesituasjon 15–20 år fram i tid. Det vil si at trafikkvolum (ÅDT), som er en av de viktigste parameterne i støyberegningsmodellen, er fremskrevet (basert på prognoser) til oppgitt beregningsår. Beregningshøyden er 4 meter. Kartleggingene er gjennomført med Statens vegvesens beregningsverktøy NorStøy. Beregningsmetode er Nord2000Road. Data om vegene og trafikken hentes fra Nasjonal vegdatabank (NVDB). De viktigste parameterne er ÅDT, tungtrafikkandel og hastighet. Kartdata hentes fra felles kartdatabasen (FKB). Informasjon om bygninger hentes fra matrikkelen.
status: Sendt inn

Fiskerihavner
type: Concept
in scheme: FAIR-register
top concept of: FAIR-register
definition: Fiskerihavner.
description: Fiskerihavner.
status: Sendt inn

FKB-Vann
type: Concept
in scheme: FAIR-register
top concept of: FAIR-register
definition: FKB-Vann beskriver geografisk beliggenhet, forløp og form for bekker, elver, kanaler, grøfter, innsjøer, isbreer og den topografiske delen av kyst og sjø. Primærdata kystkontur er identisk med kystkonturen i FKB-Vann
description: FKB-Vann beskriver geografisk beliggenhet, forløp og form for bekker, elver, kanaler, grøfter, innsjøer, isbreer og den topografiske delen av kyst og sjø. Primærdata kystkontur er identisk med kystkonturen i FKB-Vann
status: Sendt inn

Reindrift - Reinbeiteområde
type: Concept
in scheme: FAIR-register
top concept of: FAIR-register
definition: Datasettet avgrenser de seks reinbeiteområdene som til sammen utgjør det samiske reinbeiteområdet. Retten til å utøve reindrift innenfor disse områdene er eksklusiv for den samiske befolkning. Denne samiske særretten gjelder ikke utenfor disse områdene, hvor det kreves særskilt tillatelse for å utøve reindrift på egne og leide arealer. Et reinbeiteområde utgjør en administrativ enhet for flere reinbeitedistrikt. Statsforvalteren er forvaltningsmyndighet i reinbeiteområdene.
description: Datasettet avgrenser de seks reinbeiteområdene som til sammen utgjør det samiske reinbeiteområdet. Retten til å utøve reindrift innenfor disse områdene er eksklusiv for den samiske befolkning. Denne samiske særretten gjelder ikke utenfor disse områdene, hvor det kreves særskilt tillatelse for å utøve reindrift på egne og leide arealer. Et reinbeiteområde utgjør en administrativ enhet for flere reinbeitedistrikt. Statsforvalteren er forvaltningsmyndighet i reinbeiteområdene.
status: Sendt inn

Aktsomhetskart for kvikkleireskred
type: Concept
in scheme: FAIR-register
top concept of: FAIR-register
definition: Aktsomhetskart for kvikkleireskred er utviklet av NVE, og tar hensyn til både løsmassene og terrenget. Det kan brukes for å følge steg 2 og 3 i «Prosedyre for utredning av områdeskredfare» i NVE veileder 1/2019 «Sikkerhet mot kvikkleireskred» kapittel 3.2. Tidligere var det kartet «Aktsomhet marin leire» som ble benyttet for å sjekke steg 2 i prosedyren (Avgrens områder med mulig marin leire). «Aktsomhet marin leire» baserte seg på NGUs kart Mulighet for marin leire, og viste mulighet for sammenhengende forekomster av marin leire basert på løsmassekartene (kvartær-geologisk kartlegging). Det forelå ikke noe verktøy for steg 3 i prosedyren (Avgrens områder med terreng som kan være utsatt for områdeskred /kvikkleireskred). Aktsomhetskartet bruker «Aktsomhet marin leire» som utgangspunkt og tar i tillegg hensyn til terreng-kriteriene som er gitt i NVE veileder 1/2019. Flate områder langt unna skråninger, er dermed fjernet fra aktsomhetskartet, i tillegg til områder uten sammenhengende marin leire. Områder kartlagt som «grunnlendt» og «fjell i dagen» i Nibio AR5 Grunnforhold er tatt vekk fra kartet. Dersom planlagte tiltak ligger innenfor aktsomhetsområde for kvikkleireskred, må man gå videre i prosedyren i NVE veileder 1/2019. Metodikken aktsomhetskartet bygger på identifiserer mulige løsneområder for kvikkleireskred. NVE vurderte at aktsomhetskartet også markerer i tilstrekkelig grad hvor det kan være fare for skade fra utløp fra et kvikkleire-skred. Det er dermed ikke nødvendig å vurdere fare for utløp utenfor aktsomhetskartet. Unntaket er der det ligger utløp fra registrerte faresoner utenom aktsomhetsområdet, dette må i så fall følge prosedyren i NVE veileder 1/2019 videre fra steg 4.
description: Aktsomhetskart for kvikkleireskred er utviklet av NVE, og tar hensyn til både løsmassene og terrenget. Det kan brukes for å følge steg 2 og 3 i «Prosedyre for utredning av områdeskredfare» i NVE veileder 1/2019 «Sikkerhet mot kvikkleireskred» kapittel 3.2. Tidligere var det kartet «Aktsomhet marin leire» som ble benyttet for å sjekke steg 2 i prosedyren (Avgrens områder med mulig marin leire). «Aktsomhet marin leire» baserte seg på NGUs kart Mulighet for marin leire, og viste mulighet for sammenhengende forekomster av marin leire basert på løsmassekartene (kvartær-geologisk kartlegging). Det forelå ikke noe verktøy for steg 3 i prosedyren (Avgrens områder med terreng som kan være utsatt for områdeskred /kvikkleireskred). Aktsomhetskartet bruker «Aktsomhet marin leire» som utgangspunkt og tar i tillegg hensyn til terreng-kriteriene som er gitt i NVE veileder 1/2019. Flate områder langt unna skråninger, er dermed fjernet fra aktsomhetskartet, i tillegg til områder uten sammenhengende marin leire. Områder kartlagt som «grunnlendt» og «fjell i dagen» i Nibio AR5 Grunnforhold er tatt vekk fra kartet. Dersom planlagte tiltak ligger innenfor aktsomhetsområde for kvikkleireskred, må man gå videre i prosedyren i NVE veileder 1/2019. Metodikken aktsomhetskartet bygger på identifiserer mulige løsneområder for kvikkleireskred. NVE vurderte at aktsomhetskartet også markerer i tilstrekkelig grad hvor det kan være fare for skade fra utløp fra et kvikkleire-skred. Det er dermed ikke nødvendig å vurdere fare for utløp utenfor aktsomhetskartet. Unntaket er der det ligger utløp fra registrerte faresoner utenom aktsomhetsområdet, dette må i så fall følge prosedyren i NVE veileder 1/2019 videre fra steg 4.
status: Sendt inn

FKB-Lufthavn
type: Concept
in scheme: FAIR-register
top concept of: FAIR-register
definition: FKB-Lufthavn er en del av Felles Kartdatabase (FKB). FKB er en samling datasett som utgjør en sentral del av grunnkartet. Se metadataoppføring for Felles Kartdatabase for mer info. FKB-Lufthavn omfatter et begrenset utvalg av objekttyper for lufthavner som skal registreres og forvaltes i FKB. Avinor har en mer detaljert spesifikasjon som benyttes for datafangst og forvaltning av data for Avinors egne lufthavner. Data etter denne spesifikasjonen skal kunne avledes fra Avinors data. FKB-data er ikke-sensistive og åpne data. FKB-dataene er finansiert gjennom Geovekst-samarbeidet, eller kommunene alene for kommuner som står utenfor Geovekst. FKB-dataene er fritt tilgjengelige for Norge digitalt parter og kan lastes ned gjennom nedlastingsløsningen på Geonorge. Private aktører må kjøpe tilgang til dataene gjennom en forhandler.
description: FKB-Lufthavn er en del av Felles Kartdatabase (FKB). FKB er en samling datasett som utgjør en sentral del av grunnkartet. Se metadataoppføring for Felles Kartdatabase for mer info. FKB-Lufthavn omfatter et begrenset utvalg av objekttyper for lufthavner som skal registreres og forvaltes i FKB. Avinor har en mer detaljert spesifikasjon som benyttes for datafangst og forvaltning av data for Avinors egne lufthavner. Data etter denne spesifikasjonen skal kunne avledes fra Avinors data. FKB-data er ikke-sensistive og åpne data. FKB-dataene er finansiert gjennom Geovekst-samarbeidet, eller kommunene alene for kommuner som står utenfor Geovekst. FKB-dataene er fritt tilgjengelige for Norge digitalt parter og kan lastes ned gjennom nedlastingsløsningen på Geonorge. Private aktører må kjøpe tilgang til dataene gjennom en forhandler.
status: Sendt inn

SSB-arealbruk 2025
type: Concept
in scheme: FAIR-register
top concept of: FAIR-register
definition: SSB-arealbruk skal være et landsdekkende datasett som gir oversikt over bebygd og opparbeidet areal og hvordan dette brukes. Datasettet danner deler av grunnlaget for SSBs arealstatistikk. SSB-arealbruk er basert på en rekke digitale kartdata, tilrettelagt og sammensatt slik at det kvalitetsmessig beste datasettet blir valgt ut der det er tilgjengelig, men der slikt datagrunnlag ikke finnes tas datagrunnlag av enklere kvalitet inn.
description: SSB-arealbruk skal være et landsdekkende datasett som gir oversikt over bebygd og opparbeidet areal og hvordan dette brukes. Datasettet danner deler av grunnlaget for SSBs arealstatistikk. SSB-arealbruk er basert på en rekke digitale kartdata, tilrettelagt og sammensatt slik at det kvalitetsmessig beste datasettet blir valgt ut der det er tilgjengelig, men der slikt datagrunnlag ikke finnes tas datagrunnlag av enklere kvalitet inn.
status: Sendt inn

FKB-Bygning
type: Concept
in scheme: FAIR-register
top concept of: FAIR-register
definition: FKB-Bygning er en del av Felles Kartdatabase (FKB). FKB er en samling datasett som utgjør en sentral del av grunnkartet. Se metadataoppføring for Felles Kartdatabase for mer info. FKB-Bygning inneholder detaljert bygningsinformasjon. Dataene omfatter beskrivelse av alle typer bygninger, takoverbygg, beskrivende bygningslinjer (for eksempel mønelinje) samt bygningsvedheng (for eksempel veranda). FKB-Bygning benytter samme definisjon/inndeling av en bygning som matrikkelen og har en 1:1 kobling mot matrikkelen ved at bygningsnummer fra matrikkelen legges inn på bygningene i FKB-Bygning. FKB-Bygning bygger på en 2.5D bygningsmodell. Det innebærer at dataene ikke inneholder volum/3D-objekter, men at høydeverdiene til toppen av objektene registreres. Enkle 3D-modeller kan dermed lages ved å projisere FKB-dataene ned på en terrengmodell. FKB-data er ikke-sensistive og åpne data. FKB-dataene er finansiert gjennom Geovekst-samarbeidet, eller kommunene alene for kommuner som står utenfor Geovekst. FKB-dataene er fritt tilgjengelige for Norge digitalt parter og kan lastes ned gjennom nedlastingsløsningen på Geonorge. Private aktører må kjøpe tilgang til dataene gjennom en forhandler.
description: FKB-Bygning er en del av Felles Kartdatabase (FKB). FKB er en samling datasett som utgjør en sentral del av grunnkartet. Se metadataoppføring for Felles Kartdatabase for mer info. FKB-Bygning inneholder detaljert bygningsinformasjon. Dataene omfatter beskrivelse av alle typer bygninger, takoverbygg, beskrivende bygningslinjer (for eksempel mønelinje) samt bygningsvedheng (for eksempel veranda). FKB-Bygning benytter samme definisjon/inndeling av en bygning som matrikkelen og har en 1:1 kobling mot matrikkelen ved at bygningsnummer fra matrikkelen legges inn på bygningene i FKB-Bygning. FKB-Bygning bygger på en 2.5D bygningsmodell. Det innebærer at dataene ikke inneholder volum/3D-objekter, men at høydeverdiene til toppen av objektene registreres. Enkle 3D-modeller kan dermed lages ved å projisere FKB-dataene ned på en terrengmodell. FKB-data er ikke-sensistive og åpne data. FKB-dataene er finansiert gjennom Geovekst-samarbeidet, eller kommunene alene for kommuner som står utenfor Geovekst. FKB-dataene er fritt tilgjengelige for Norge digitalt parter og kan lastes ned gjennom nedlastingsløsningen på Geonorge. Private aktører må kjøpe tilgang til dataene gjennom en forhandler.
status: Sendt inn

Ankringsområder
type: Concept
in scheme: FAIR-register
top concept of: FAIR-register
definition: Ankringsområde inneholder tre objekttyper og tilhørende informasjon særlig rettet mot kystsoneforvaltning og kystsoneplanlegging. Annen informasjon for de aktuelle områdene til støtte for operativ bruk av områdene er ikke inkludert her. For «featureType» Ankringsområde for sjøtransport, vil disse også finnes igjen med ulik symbolisering og informasjonsinnhold i sjøkartene og Den norske los. Denne «nautiske» informasjonen må hentes i de produktene, og er ikke del av dette produktet. For «featureType» Opplagsområde for sjøtransport, og Riggområde i sjø er det også informasjon med hensyn til kystsoneforvaltning og planlegging som er inkludert. Datasett holdes løpende ajour av Kystverket i samarbeid med andre maritime aktører og andre berørte.
description: Ankringsområde inneholder tre objekttyper og tilhørende informasjon særlig rettet mot kystsoneforvaltning og kystsoneplanlegging. Annen informasjon for de aktuelle områdene til støtte for operativ bruk av områdene er ikke inkludert her. For «featureType» Ankringsområde for sjøtransport, vil disse også finnes igjen med ulik symbolisering og informasjonsinnhold i sjøkartene og Den norske los. Denne «nautiske» informasjonen må hentes i de produktene, og er ikke del av dette produktet. For «featureType» Opplagsområde for sjøtransport, og Riggområde i sjø er det også informasjon med hensyn til kystsoneforvaltning og planlegging som er inkludert. Datasett holdes løpende ajour av Kystverket i samarbeid med andre maritime aktører og andre berørte.
status: Sendt inn

Eksplosivanlegg
type: Concept
in scheme: FAIR-register
top concept of: FAIR-register
definition: Datasettet Eksplosivanlegg viser anlegg hvor eksplosive varer tilvirkes eller oppbevares, og som har tillatelse fra Direktoratet for samfunnssikkerhet og beredskap (DSB) , se §§ 6.1 og 7.1 i Eksplosivforskriften. Merk at dette ikke omfatter Forsvarets anlegg. Datasettet gis bare ut til bruk i kommunal og regional beredskap, arealplanlegging og byggesaksbehandling og bare ved direkte henvendelse til DSB ved kart@dsb.no.
description: Datasettet Eksplosivanlegg viser anlegg hvor eksplosive varer tilvirkes eller oppbevares, og som har tillatelse fra Direktoratet for samfunnssikkerhet og beredskap (DSB) , se §§ 6.1 og 7.1 i Eksplosivforskriften. Merk at dette ikke omfatter Forsvarets anlegg. Datasettet gis bare ut til bruk i kommunal og regional beredskap, arealplanlegging og byggesaksbehandling og bare ved direkte henvendelse til DSB ved kart@dsb.no.
status: Sendt inn

Reindrift - Trekklei
type: Concept
in scheme: FAIR-register
top concept of: FAIR-register
definition: Datasettet trekklei viser viktige naturlige trekk mellom ulike beiteområder og forbi passasjer, der reinen trekker av seg selv, enten enkeltvis eller i flokk. Datasettet viser dagens arealbruk og er å regne som veiledende illustrasjon på hvordan reindriftsnæringen i hovedsak og normalt bruker områdene.
description: Datasettet trekklei viser viktige naturlige trekk mellom ulike beiteområder og forbi passasjer, der reinen trekker av seg selv, enten enkeltvis eller i flokk. Datasettet viser dagens arealbruk og er å regne som veiledende illustrasjon på hvordan reindriftsnæringen i hovedsak og normalt bruker områdene.
status: Sendt inn

Reindrift - Oppsamlingsområde
type: Concept
in scheme: FAIR-register
top concept of: FAIR-register
definition: Datasettet oppsamlingsområde viser områder som har kvaliteter (godt beite, oversiktlig, naturlig avgrensning etc.) som gjør det enklere for reineiere å kunne utøve kontroll over flokken i et ønsket tidsrom. Oppsamlingsområder benyttes når reinen samles for å foreta kalvemerking, skilling, slakting eller flytting. Datasettet viser dagens arealbruk og er å regne som veiledende illustrasjon på hvordan reindriftsnæringen i hovedsak og normalt bruker områdene.
description: Datasettet oppsamlingsområde viser områder som har kvaliteter (godt beite, oversiktlig, naturlig avgrensning etc.) som gjør det enklere for reineiere å kunne utøve kontroll over flokken i et ønsket tidsrom. Oppsamlingsområder benyttes når reinen samles for å foreta kalvemerking, skilling, slakting eller flytting. Datasettet viser dagens arealbruk og er å regne som veiledende illustrasjon på hvordan reindriftsnæringen i hovedsak og normalt bruker områdene.
status: Sendt inn

Nasjonale laksefjorder
type: Concept
in scheme: FAIR-register
top concept of: FAIR-register
definition: Datasettet viser nasjonale laksefjorder opprettet etter vedtak i stortinget 25. februar 2003 og 15. mai 2007. Nasjonale laksefjorder skal gi et utvalg av de viktigste laksebestandene i Norge en særlig beskyttelse mot inngrep og aktiviteter i vassdragene og mot oppdrettsvirksomhet i de nærliggende fjord- og kystområdene.
description: Datasettet viser nasjonale laksefjorder opprettet etter vedtak i stortinget 25. februar 2003 og 15. mai 2007. Nasjonale laksefjorder skal gi et utvalg av de viktigste laksebestandene i Norge en særlig beskyttelse mot inngrep og aktiviteter i vassdragene og mot oppdrettsvirksomhet i de nærliggende fjord- og kystområdene.
status: Sendt inn

Administrative enheter kommuner
type: Concept
in scheme: FAIR-register
top concept of: FAIR-register
definition: Datasettet viser kommuneinndelinga i landet med de mest nøyaktige grensene som er registrert digitalt og som er samlet i ett datasett. Datasettet har referansedato 1.7.2025, og er oppdatert med overføring av et areal mellom Sel og Vågå ved Liaskarven - Rudihøe, i tillegg til ei retting av kommunegrensa mellom Stavanger og Sola ved Liapynten. Flatene inneholder egenskaper som forteller om offisielle kommunenumre. De offisielle norske, samiske og kvenske navnene for kommunene er hentet fra SSR. I tillegg finnes informasjon om samiske forvaltningsområder. Geodataene er fra nasjonal inndelingsbase, som er en del av matrikkelen. Ved overgang til ny forvaltningsløsning, ble det også gjort endringer i UML-modellen.
description: Datasettet viser kommuneinndelinga i landet med de mest nøyaktige grensene som er registrert digitalt og som er samlet i ett datasett. Datasettet har referansedato 1.7.2025, og er oppdatert med overføring av et areal mellom Sel og Vågå ved Liaskarven - Rudihøe, i tillegg til ei retting av kommunegrensa mellom Stavanger og Sola ved Liapynten. Flatene inneholder egenskaper som forteller om offisielle kommunenumre. De offisielle norske, samiske og kvenske navnene for kommunene er hentet fra SSR. I tillegg finnes informasjon om samiske forvaltningsområder. Geodataene er fra nasjonal inndelingsbase, som er en del av matrikkelen. Ved overgang til ny forvaltningsløsning, ble det også gjort endringer i UML-modellen.
status: Sendt inn

Flom aktsomhetsområder
type: Concept
in scheme: FAIR-register
top concept of: FAIR-register
definition: NVEs aktsomhetskart for flom er et nasjonalt datasett som på oversiktsnivå viser hvilke arealer som kan være utsatt for flomfare. Potensielt flomutsatte områder vises som polygon på kartet, men inneholder ikke informasjon om den årlige sannsynligheten for flom.
description: NVEs aktsomhetskart for flom er et nasjonalt datasett som på oversiktsnivå viser hvilke arealer som kan være utsatt for flomfare. Potensielt flomutsatte områder vises som polygon på kartet, men inneholder ikke informasjon om den årlige sannsynligheten for flom.
status: Sendt inn

Vannkraft, Utbygd og ikke utbygd
type: Concept
in scheme: FAIR-register
top concept of: FAIR-register
definition: Dette datasettet inneholder vannkraft systemet slik det forvaltes av NVE. I NVEs forvaltningssystem behandles også dammer til andre formål enn vannkraftproduksjon. Regulerte innsjøer påvirker vassdragene uavhengig av formål, og de er derfor også med i våre forvaltningssystemer. Datasettet innbefatter alle dammer og regulerte innsjøer uavhengig av formål. Spesifikasjonen omfatter både anlegg i drift og ikke i drift. NVE behandler søknader om konsesjon etter energiloven og/eller vassdragslovgivningen til bygging av vannkraft og andre anlegg i vassdragene. De ikke utbygde anlegg omfatter prosjekter behandlet i vassdragskonsesjonsprosessen og restpotensialet som ikke er konsesjonssøkt.
description: Dette datasettet inneholder vannkraft systemet slik det forvaltes av NVE. I NVEs forvaltningssystem behandles også dammer til andre formål enn vannkraftproduksjon. Regulerte innsjøer påvirker vassdragene uavhengig av formål, og de er derfor også med i våre forvaltningssystemer. Datasettet innbefatter alle dammer og regulerte innsjøer uavhengig av formål. Spesifikasjonen omfatter både anlegg i drift og ikke i drift. NVE behandler søknader om konsesjon etter energiloven og/eller vassdragslovgivningen til bygging av vannkraft og andre anlegg i vassdragene. De ikke utbygde anlegg omfatter prosjekter behandlet i vassdragskonsesjonsprosessen og restpotensialet som ikke er konsesjonssøkt.
status: Sendt inn

Kulturminner - Freda bygninger
type: Concept
in scheme: FAIR-register
top concept of: FAIR-register
definition: Bygninger og kirker som er automatisk, vedtaks-, forskrifts- eller midlertidig fredet etter lov og kirker som har status som listeførte. Bygninger kan fredes etter ulike paragrafer i kulturminneloven: Bygninger som blir vedtatt fredet (kml § 15), statlige bygninger som blir vedtatt fredet i forskrift (kml § 22a), bygninger som er eldre enn 1537 er automatisk fredet (kml § 4), stående byggverk med opprinnelse fra perioden 1537-1649 kan bli erklært fredet (kml § 4), samiske bygninger eldre enn 100 år er automatisk fredet (kml § 4).
description: Bygninger og kirker som er automatisk, vedtaks-, forskrifts- eller midlertidig fredet etter lov og kirker som har status som listeførte. Bygninger kan fredes etter ulike paragrafer i kulturminneloven: Bygninger som blir vedtatt fredet (kml § 15), statlige bygninger som blir vedtatt fredet i forskrift (kml § 22a), bygninger som er eldre enn 1537 er automatisk fredet (kml § 4), stående byggverk med opprinnelse fra perioden 1537-1649 kan bli erklært fredet (kml § 4), samiske bygninger eldre enn 100 år er automatisk fredet (kml § 4).
status: Sendt inn

Kulturminner - SEFRAK-bygninger
type: Concept
in scheme: FAIR-register
top concept of: FAIR-register
definition: SEFRAK er et landsdekkende register over eldre bygninger og andre kulturminner i Norge. Navnet er en forkortelse for SEkretariatet For Registrering Av faste Kulturminner, som var navnet på den institusjonen som påbegynte arbeidet med registeret. I dag ligger ansvaret for registering og vedlikehold av data hos Riksantikvaren. Alle bygninger fra før år 1900 ble registrert, foruten ruiner og en del andre kulturminner. I Finnmark ble grensa for innføring i registeret satt til året 1945. Det at et hus er registrert i SEFRAK gir det ikke automatisk vernestatus, og legger heller ikke spesifikke restriksjoner på hva som kan gjøres med det. SEFRAK-registeret sier ikke noe om objektenes verneverdi.
description: SEFRAK er et landsdekkende register over eldre bygninger og andre kulturminner i Norge. Navnet er en forkortelse for SEkretariatet For Registrering Av faste Kulturminner, som var navnet på den institusjonen som påbegynte arbeidet med registeret. I dag ligger ansvaret for registering og vedlikehold av data hos Riksantikvaren. Alle bygninger fra før år 1900 ble registrert, foruten ruiner og en del andre kulturminner. I Finnmark ble grensa for innføring i registeret satt til året 1945. Det at et hus er registrert i SEFRAK gir det ikke automatisk vernestatus, og legger heller ikke spesifikke restriksjoner på hva som kan gjøres med det. SEFRAK-registeret sier ikke noe om objektenes verneverdi.
status: Sendt inn

Stormflo og havnivå
type: Concept
in scheme: FAIR-register
top concept of: FAIR-register
definition: Merk at datasettet "Stormflo og havnivå" kom i ny utgave da DSBs veileder ble oppdatert 1. juli 2024. I januar 2025 kom det forbedringer som blant annet fjernet isolerte, oversvømte arealer på land som ikke var reelle. Det er planlagt flere forbedringer av datasettet utover våren som spesielt vil forbedre datasettet for enkelte fjorder/basseng med trang åpning. En konsekvens av menneskeskapte klimaendringer er at havnivået stiger. Rapporten Sea-Level Rise and Extremes in Norway (2024) viser at også i Norge vil vi merke den økende stigningen. I veilederen «Havnivåstigning og høye vannstander i samfunnsplanlegging» (2024) kommer DSB med råd og anbefalinger om hvordan kommunene skal ta hensyn til havnivåstigning i sin planlegging, både på kort og lang sikt, og for ny og eksisterende bebyggelse. Hensikten er å forebygge risiko for tap av liv, skade på helse, miljø og viktig infrastruktur, materielle verdier mv. på grunn av oversvømmelse. I tillegg til havnivåstigning, omhandler veilederen høye vannstander (stormflo) fordi havnivåstigningen fører til at høye vannstander vil inntreffe lenger, og oftere, inn over land enn hva som er tilfelle i dag. Informasjon om de høye vannstander med dagens havnivå eller med et framtidig havnivå som denne veilederen anbefaler kommunene å bruke, er samlet i dette datasettet. Videre har Kartverket modellert hvilke areal som kan bli berørt av oversvømmelse ved de ulike høye vannstandene, nå og i framtiden. De høye vannstandene tilsvarer sikkerhetsklassene for flom brukt i TEK17 som er 20-års, 200-års og 1000-års stormflo. I tillegg finnes et «øvre estimat vannstand» som er anbefalt brukt for bygg som omfattes av TEK17 § 7-2 første ledd. Noen av disse høye vannstandene kommer også med klimapåslaget for havnivåendring frem til år 2100 eller år 2150. I tråd med det nye føre-var-grunnlaget for klimatilpasning i Norge er klimapåslaget basert på utslippsscenario SSP3-7.0 der man bruker 83-prosentiler for det sannsynlige utfallsrommet. Datasettet…
description: Merk at datasettet "Stormflo og havnivå" kom i ny utgave da DSBs veileder ble oppdatert 1. juli 2024. I januar 2025 kom det forbedringer som blant annet fjernet isolerte, oversvømte arealer på land som ikke var reelle. Det er planlagt flere forbedringer av datasettet utover våren som spesielt vil forbedre datasettet for enkelte fjorder/basseng med trang åpning. En konsekvens av menneskeskapte klimaendringer er at havnivået stiger. Rapporten Sea-Level Rise and Extremes in Norway (2024) viser at også i Norge vil vi merke den økende stigningen. I veilederen «Havnivåstigning og høye vannstander i samfunnsplanlegging» (2024) kommer DSB med råd og anbefalinger om hvordan kommunene skal ta hensyn til havnivåstigning i sin planlegging, både på kort og lang sikt, og for ny og eksisterende bebyggelse. Hensikten er å forebygge risiko for tap av liv, skade på helse, miljø og viktig infrastruktur, materielle verdier mv. på grunn av oversvømmelse. I tillegg til havnivåstigning, omhandler veilederen høye vannstander (stormflo) fordi havnivåstigningen fører til at høye vannstander vil inntreffe lenger, og oftere, inn over land enn hva som er tilfelle i dag. Informasjon om de høye vannstander med dagens havnivå eller med et framtidig havnivå som denne veilederen anbefaler kommunene å bruke, er samlet i dette datasettet. Videre har Kartverket modellert hvilke areal som kan bli berørt av oversvømmelse ved de ulike høye vannstandene, nå og i framtiden. De høye vannstandene tilsvarer sikkerhetsklassene for flom brukt i TEK17 som er 20-års, 200-års og 1000-års stormflo. I tillegg finnes et «øvre estimat vannstand» som er anbefalt brukt for bygg som omfattes av TEK17 § 7-2 første ledd. Noen av disse høye vannstandene kommer også med klimapåslaget for havnivåendring frem til år 2100 eller år 2150. I tråd med det nye føre-var-grunnlaget for klimatilpasning i Norge er klimapåslaget basert på utslippsscenario SSP3-7.0 der man bruker 83-prosentiler for det sannsynlige utfallsrommet. Datasettet…
status: Sendt inn

Løsmasser
type: Concept
in scheme: FAIR-register
top concept of: FAIR-register
definition: Løsmassedataene viser utbredelsen av løsmassetyper (også benevnt jordarter). Løsmassetypene er klassifisert etter deres dannelsesmåte. Dataene viser hvilken løsmassetype som dominerer i terrengoverflaten, og avspeiler landskapets oppbygning og utvikling. Det er viktig å være klar over at andre løsmassetyper kan opptre i dypet. Dataene viser også arealer med fjell uten løsmassedekke. Datasettet er landsdekkende og representerer de beste løsmasseregistreringene i databasen.
description: Løsmassedataene viser utbredelsen av løsmassetyper (også benevnt jordarter). Løsmassetypene er klassifisert etter deres dannelsesmåte. Dataene viser hvilken løsmassetype som dominerer i terrengoverflaten, og avspeiler landskapets oppbygning og utvikling. Det er viktig å være klar over at andre løsmassetyper kan opptre i dypet. Dataene viser også arealer med fjell uten løsmassedekke. Datasettet er landsdekkende og representerer de beste løsmasseregistreringene i databasen.
status: Sendt inn

Byggeforbudssoner kraftledninger
type: Concept
in scheme: FAIR-register
top concept of: FAIR-register
definition: Datasettet Byggeforbudssoner kraftledninger inneholder byggeforbudssoner for Statnetts kraftledninger. Dette er arealer rundt kraftledninger som er klausulert i medhold av konsesjon etter energiloven og ekspropriasjon etter oreigningslova eller minnelig avtale med berørte grunneiere. Byggeforbudssonen legger restriksjoner på aktivitet i denne sonen. Det er ikke tillatt med ny bebyggelse innenfor byggeforbudssonen og alle tiltak i terrenget og anleggsarbeid innenfor byggeforbudssonen skal på forhånd avklares med ledningseier. Datasettet er et landsdekkende datasett for Statnett. Statnett ønsker i tillegg å informere om at det er en varslingsplikt til ledningseier for anleggsarbeid (maskiner og utstyr) som kan nå innenfor 30 meter fra ytterste strømførende ledning. Da skal ledningseier kontaktes for nødvendig avklaringer og tillatelse til anleggsarbeid innenfor denne varslingssonen. Datasettet har tidligere blitt kalt Hensynssoner kraftledninger.
description: Datasettet Byggeforbudssoner kraftledninger inneholder byggeforbudssoner for Statnetts kraftledninger. Dette er arealer rundt kraftledninger som er klausulert i medhold av konsesjon etter energiloven og ekspropriasjon etter oreigningslova eller minnelig avtale med berørte grunneiere. Byggeforbudssonen legger restriksjoner på aktivitet i denne sonen. Det er ikke tillatt med ny bebyggelse innenfor byggeforbudssonen og alle tiltak i terrenget og anleggsarbeid innenfor byggeforbudssonen skal på forhånd avklares med ledningseier. Datasettet er et landsdekkende datasett for Statnett. Statnett ønsker i tillegg å informere om at det er en varslingsplikt til ledningseier for anleggsarbeid (maskiner og utstyr) som kan nå innenfor 30 meter fra ytterste strømførende ledning. Da skal ledningseier kontaktes for nødvendig avklaringer og tillatelse til anleggsarbeid innenfor denne varslingssonen. Datasettet har tidligere blitt kalt Hensynssoner kraftledninger.
status: Sendt inn

N250 Kartdata
type: Concept
in scheme: FAIR-register
top concept of: FAIR-register
definition: N250 Kartdata er en generalisering av N50 Kartdata og kartografisk tilpasset målestokk 1:100 000 - 1:300 000. N250 Kartdata dekker fastlands-Norge begrenset av riksgrensen mot nabolandene og territorialgrensen i havet. N250 Kartdata ajourføres kontinuerlig og distribueres ukentlig.
description: N250 Kartdata er en generalisering av N50 Kartdata og kartografisk tilpasset målestokk 1:100 000 - 1:300 000. N250 Kartdata dekker fastlands-Norge begrenset av riksgrensen mot nabolandene og territorialgrensen i havet. N250 Kartdata ajourføres kontinuerlig og distribueres ukentlig.
status: Sendt inn

Naturtyper på land (NiN)
type: Concept
in scheme: FAIR-register
top concept of: FAIR-register
definition: Datasettet er tidligere publisert under navnet "Naturtyper - Miljødirektoratets instruks". Datasettet viser naturtypelokaliteter kartlagt etter Miljødirektoratets instruks for kartlegging av naturtyper på land. Naturtyper prioritert for kartlegging er rødlistede naturtyper og naturtyper med sentral økosystemfunksjon. Type- og beskrivelsessystemet Natur i Norge er benyttet for å dokumentere det faglige innholdet. Hver lokalitet er gitt en økologisk kvalitet, basert på tilstand og naturmangfold. Den enkelte lokalitet består av én naturtype, som er beskrevet i instruksen. Naturtypen har en definisjon i form av én eller flere mulige kartleggingsenheter i NiN, eventuelt i kombinasjon med bestemte beskrivelsesvariabler (Definerende variabler). Lokalitetens økologiske tilstand registreres ved hjelp av et sett med beskrivelsesvariabler som er definert som relevante for den aktuelle naturtypen. Innslag av fremmede arter og spor etter tunge kjøretøy er eksempler på slike variabler. Basert på trinnverdier for variablene og regler i metodikken settes en samlet vurdering av tilstand. Tilsvarende vurderes lokaliteten når det gjelder naturmangfold. Naturmangfold vurderes primært med grunnlag i funn av spesifikke arter og funn av biologisk viktige livsmiljøer. Vurderingen av tilstand og naturmangfold danner grunnlag for å gi lokaliteten en samlet vurdering av økologisk kvalitet; Lokalitetskvalitet. Knyttet til tilstand og naturmangfold er det også gitt tekstlig informasjon.
description: Datasettet er tidligere publisert under navnet "Naturtyper - Miljødirektoratets instruks". Datasettet viser naturtypelokaliteter kartlagt etter Miljødirektoratets instruks for kartlegging av naturtyper på land. Naturtyper prioritert for kartlegging er rødlistede naturtyper og naturtyper med sentral økosystemfunksjon. Type- og beskrivelsessystemet Natur i Norge er benyttet for å dokumentere det faglige innholdet. Hver lokalitet er gitt en økologisk kvalitet, basert på tilstand og naturmangfold. Den enkelte lokalitet består av én naturtype, som er beskrevet i instruksen. Naturtypen har en definisjon i form av én eller flere mulige kartleggingsenheter i NiN, eventuelt i kombinasjon med bestemte beskrivelsesvariabler (Definerende variabler). Lokalitetens økologiske tilstand registreres ved hjelp av et sett med beskrivelsesvariabler som er definert som relevante for den aktuelle naturtypen. Innslag av fremmede arter og spor etter tunge kjøretøy er eksempler på slike variabler. Basert på trinnverdier for variablene og regler i metodikken settes en samlet vurdering av tilstand. Tilsvarende vurderes lokaliteten når det gjelder naturmangfold. Naturmangfold vurderes primært med grunnlag i funn av spesifikke arter og funn av biologisk viktige livsmiljøer. Vurderingen av tilstand og naturmangfold danner grunnlag for å gi lokaliteten en samlet vurdering av økologisk kvalitet; Lokalitetskvalitet. Knyttet til tilstand og naturmangfold er det også gitt tekstlig informasjon.
status: Sendt inn

Inngrepsfri natur i Norge
type: Concept
in scheme: FAIR-register
top concept of: FAIR-register
definition: Datasettet viser hvilke områder på Norges fastland (inkl. ferskvann og øyer) som ikke er berørt av større naturinngrep per januar 1988, 2008, 2013, 2018 og 2023. Inngrepsfri natur er områder som ligger en kilometer eller mer i luftlinje unna større inngrep, så som veier, større kraftlinjer, jernbane, steinbrudd, vind- og vannkraftutbygging m.fl. Dataene som danner grunnlaget for kartene er hentet fra en rekke nasjonale registre, bl.a. fra NVE, Statnett og Statens kartverk. Datasettet viser også hvilke områder som har fått endret status som følge av nye inngrep eller restaureringstiltak i perioden 1988-2008, 2008-2013, 2013-2018, 2018-2023 og 1988-2023. Utvikling i areal av inngrepsfrie naturområder er en av åtte indikatorer under nasjonalt miljømål 1.1 Naturmangfold: "Økosystemene skal ha god tilstand og levere økosystemtjenester. Inngrepsfri natur er også en etablert arealbruksindikator, som er med på å vise status og utviklingstrekk for store sammenhengende naturområder med et urørt preg i Norge.
description: Datasettet viser hvilke områder på Norges fastland (inkl. ferskvann og øyer) som ikke er berørt av større naturinngrep per januar 1988, 2008, 2013, 2018 og 2023. Inngrepsfri natur er områder som ligger en kilometer eller mer i luftlinje unna større inngrep, så som veier, større kraftlinjer, jernbane, steinbrudd, vind- og vannkraftutbygging m.fl. Dataene som danner grunnlaget for kartene er hentet fra en rekke nasjonale registre, bl.a. fra NVE, Statnett og Statens kartverk. Datasettet viser også hvilke områder som har fått endret status som følge av nye inngrep eller restaureringstiltak i perioden 1988-2008, 2008-2013, 2013-2018, 2018-2023 og 1988-2023. Utvikling i areal av inngrepsfrie naturområder er en av åtte indikatorer under nasjonalt miljømål 1.1 Naturmangfold: "Økosystemene skal ha god tilstand og levere økosystemtjenester. Inngrepsfri natur er også en etablert arealbruksindikator, som er med på å vise status og utviklingstrekk for store sammenhengende naturområder med et urørt preg i Norge.
status: Sendt inn

FKB-Grønnstruktur
type: Concept
in scheme: FAIR-register
top concept of: FAIR-register
definition: FKB-Grønnstruktur 1.0 er et datasett som kombinerer informasjon fra fjernmålingsdata og FKB-data. Datasettet viser vegetasjonsdekke inndelt i tre kategorier av sjikt: feltsjikt, busksjikt og tresjikt. I tillegg vises grå arealer som bygninger og infrastruktur, altså områder uten vegetasjon. Presisjonsnivået for enkelte egenskaper, særlig de grønne strukturene, vil være lavere enn i tradisjonelle FKB-datasett. Grønnstrukturkartet etableres ved å kombinere detaljerte offentlige kartdata, som til enhver tid omfatter alle relevante data, satellittdata fra Copernicus-programmet (VHR-opptak via Norsk Romsenter) med oppløsning 2–4 meter og høydedata fra NDH (Nasjonal detaljert høydemodell) med romlig oppløsning 1 meter x 1 meter. I tillegg benyttes informasjon fra SSB Arealbruk for å avgrense kartleggingsområdet og FKB-AR5 for å gi informasjon om jordbruksareal innenfor kartleggingsområdet.
description: FKB-Grønnstruktur 1.0 er et datasett som kombinerer informasjon fra fjernmålingsdata og FKB-data. Datasettet viser vegetasjonsdekke inndelt i tre kategorier av sjikt: feltsjikt, busksjikt og tresjikt. I tillegg vises grå arealer som bygninger og infrastruktur, altså områder uten vegetasjon. Presisjonsnivået for enkelte egenskaper, særlig de grønne strukturene, vil være lavere enn i tradisjonelle FKB-datasett. Grønnstrukturkartet etableres ved å kombinere detaljerte offentlige kartdata, som til enhver tid omfatter alle relevante data, satellittdata fra Copernicus-programmet (VHR-opptak via Norsk Romsenter) med oppløsning 2–4 meter og høydedata fra NDH (Nasjonal detaljert høydemodell) med romlig oppløsning 1 meter x 1 meter. I tillegg benyttes informasjon fra SSB Arealbruk for å avgrense kartleggingsområdet og FKB-AR5 for å gi informasjon om jordbruksareal innenfor kartleggingsområdet.
status: Sendt inn

Kulturlandskap - utvalgte
type: Concept
in scheme: FAIR-register
top concept of: FAIR-register
definition: Datasettet viser områder som er omfattet av satsingen Utvalgte kulturlandskap i jordbruket. Dette er et samarbeid og spleiselag mellom landbruks-, natur- og kulturminneforvaltningen i Norge. Arbeidet er basert på samarbeid mellom grunneiere og drivere og styresmaktene. Utvalgte kulturlandskap i jordbruket er en samling av de mest verdifulle kulturlandskapene i Norge. Formålet med satsingen er å sikre langsiktig forvaltning av et utvalg særegne landskapsområder med store biologiske og kulturhistoriske verdier som er formet av langvarig og kontinuerlig tradisjonell bruk. I utvelgelsen av områdene vektlegges at de i størst mulig grad skal omfatte kulturlandskap i jordbruket med store verdier knyttet til både biologi/naturmangfold og kulturhistorie og at det skal være realistisk å få til langsiktig drift, skjøtsel og vedlikehold.
description: Datasettet viser områder som er omfattet av satsingen Utvalgte kulturlandskap i jordbruket. Dette er et samarbeid og spleiselag mellom landbruks-, natur- og kulturminneforvaltningen i Norge. Arbeidet er basert på samarbeid mellom grunneiere og drivere og styresmaktene. Utvalgte kulturlandskap i jordbruket er en samling av de mest verdifulle kulturlandskapene i Norge. Formålet med satsingen er å sikre langsiktig forvaltning av et utvalg særegne landskapsområder med store biologiske og kulturhistoriske verdier som er formet av langvarig og kontinuerlig tradisjonell bruk. I utvelgelsen av områdene vektlegges at de i størst mulig grad skal omfatte kulturlandskap i jordbruket med store verdier knyttet til både biologi/naturmangfold og kulturhistorie og at det skal være realistisk å få til langsiktig drift, skjøtsel og vedlikehold.
status: Sendt inn

Kulturlandskap - verdifulle
type: Concept
in scheme: FAIR-register
top concept of: FAIR-register
definition: Datasettet består av verdifulle kulturlandskap med registrerte biologiske verdier og/eller kulturminneverdier. Biologiske verdier kan være naturtyper, som f.eks. artsrike slåtteenger eller kystlynghei. Kulturhistoriske verdier kan være f.eks. hus, steinmurer og gravrøyser. Enkeltlokaliteter av kulturbetingete naturtyper er i stor grad rekartlagt etter 2005 og lagt inn i datasettet Naturtyper - DN-håndbok 13. Datasettet har historikk tilbake til tidlig 1990-tall og prosjektet "Nasjonal registrering av verdifulle kulturlandskap". Førstegangs registrering pågikk i 1992-1994. Supplerende registreringer og oppdateringer er gjennomført av fylkesmennene, i varierende omfang. Registreringene ble utført både med tanke på å dokumentere verdier og å danne grunnlag for prioritering av offentlig innsats for å stimulere til og støtte ulike forvaltningstiltak for å ivareta verdiene.
description: Datasettet består av verdifulle kulturlandskap med registrerte biologiske verdier og/eller kulturminneverdier. Biologiske verdier kan være naturtyper, som f.eks. artsrike slåtteenger eller kystlynghei. Kulturhistoriske verdier kan være f.eks. hus, steinmurer og gravrøyser. Enkeltlokaliteter av kulturbetingete naturtyper er i stor grad rekartlagt etter 2005 og lagt inn i datasettet Naturtyper - DN-håndbok 13. Datasettet har historikk tilbake til tidlig 1990-tall og prosjektet "Nasjonal registrering av verdifulle kulturlandskap". Førstegangs registrering pågikk i 1992-1994. Supplerende registreringer og oppdateringer er gjennomført av fylkesmennene, i varierende omfang. Registreringene ble utført både med tanke på å dokumentere verdier og å danne grunnlag for prioritering av offentlig innsats for å stimulere til og støtte ulike forvaltningstiltak for å ivareta verdiene.
status: Sendt inn

SR16 - Skogressurskart 16x16 meter
type: Concept
in scheme: FAIR-register
top concept of: FAIR-register
definition: SR16 er et heldekkende datasett som gir oversikt over utbredelsen og egenskaper ved landets skogressurser. SR16 er delt opp i SR16R som er et rasterkart og SR16V som er et vektorkart. Datasettet er fremstilt gjennom automatiske prosesser som en kombinasjon av eksiterende kart (AR5), terrengmodeller, 3D fjernmålingsdata (fotogrammetri og laser) og landsskogflater. SR16 er fremstilt som et pikselkart (16 x 16 meter) og som et vektorkart som generaliserer pikselkartet til større figurer (polygoner) av relativ homogen skog. De fleste egenskapene i SR16V er beregnet som et gjennomsnitt av verdiene fra pikslene i SR16R.
description: SR16 er et heldekkende datasett som gir oversikt over utbredelsen og egenskaper ved landets skogressurser. SR16 er delt opp i SR16R som er et rasterkart og SR16V som er et vektorkart. Datasettet er fremstilt gjennom automatiske prosesser som en kombinasjon av eksiterende kart (AR5), terrengmodeller, 3D fjernmålingsdata (fotogrammetri og laser) og landsskogflater. SR16 er fremstilt som et pikselkart (16 x 16 meter) og som et vektorkart som generaliserer pikselkartet til større figurer (polygoner) av relativ homogen skog. De fleste egenskapene i SR16V er beregnet som et gjennomsnitt av verdiene fra pikslene i SR16R.
status: Sendt inn

FKB-Tiltak
type: Concept
in scheme: FAIR-register
top concept of: FAIR-register
definition: FKB-Tiltak er en del av Felles Kartdatabase (FKB). FKB er en samling datasett som utgjør en sentral del av grunnkartet. Se metadataoppføring for Felles Kartdatabase for mer info. FKB-Tiltak skal inneholde objekter (områder der det skjer utbygging) som er omsøkt/godkjent gjennom saksbehandling i kommunen eller andre offentlige myndigheter. Denne informasjonen viser hvor det skjer endringer i terrenget og kan derfor brukes som metadata for de øvrige FKB-datasettene. I tillegg er målet at dataene i FKB-Tiltak nyttes til å få til en raskere oppdatering av grunnkartet når utbyggingen er ferdig. For objekttypene BygningTiltak/BygningKnekklinje overføres geometrien automatisk til FKB-Bygning når bygningen ferdigstilles (dersom data av bedre kvalitet ikke finnes). Objekter som er ferdig bygd og registrert i grunnkartet merkes som kartlagt (KARTREG 2) i tiltaksbasen, men vil normalt ikke bli slettet slik at historikken i FKB-Tiltak er tilgjengelig. FKB-data er ikke-sensistive og åpne data. FKB-dataene er finansiert gjennom Geovekst-samarbeidet, eller kommunene alene for kommuner som står utenfor Geovekst. FKB-dataene er fritt tilgjengelige for Norge digitalt parter og kan lastes ned gjennom nedlastingsløsningen på Geonorge. Private aktører må kjøpe tilgang til dataene gjennom en forhandler.
description: FKB-Tiltak er en del av Felles Kartdatabase (FKB). FKB er en samling datasett som utgjør en sentral del av grunnkartet. Se metadataoppføring for Felles Kartdatabase for mer info. FKB-Tiltak skal inneholde objekter (områder der det skjer utbygging) som er omsøkt/godkjent gjennom saksbehandling i kommunen eller andre offentlige myndigheter. Denne informasjonen viser hvor det skjer endringer i terrenget og kan derfor brukes som metadata for de øvrige FKB-datasettene. I tillegg er målet at dataene i FKB-Tiltak nyttes til å få til en raskere oppdatering av grunnkartet når utbyggingen er ferdig. For objekttypene BygningTiltak/BygningKnekklinje overføres geometrien automatisk til FKB-Bygning når bygningen ferdigstilles (dersom data av bedre kvalitet ikke finnes). Objekter som er ferdig bygd og registrert i grunnkartet merkes som kartlagt (KARTREG 2) i tiltaksbasen, men vil normalt ikke bli slettet slik at historikken i FKB-Tiltak er tilgjengelig. FKB-data er ikke-sensistive og åpne data. FKB-dataene er finansiert gjennom Geovekst-samarbeidet, eller kommunene alene for kommuner som står utenfor Geovekst. FKB-dataene er fritt tilgjengelige for Norge digitalt parter og kan lastes ned gjennom nedlastingsløsningen på Geonorge. Private aktører må kjøpe tilgang til dataene gjennom en forhandler.
status: Sendt inn

Militære forbudsområder innen sjøforsvaret
type: Concept
in scheme: FAIR-register
top concept of: FAIR-register
definition: Datasett i henhold til Forskrift om militære forbudsområder innen Sjøforsvaret. Link til forskriften: https://lovdata.no/dokument/LTI/forskrift/2024-06-24-1311. Forskriften eies av Forsvarsdepartementet. Forsvarsbygg ivaretar Forsvarets arealbruksinteresser i arealplansammenheng, og det er derfor Forsvarsbygg som distribuerer datasettet i Geonorge.
description: Datasett i henhold til Forskrift om militære forbudsområder innen Sjøforsvaret. Link til forskriften: https://lovdata.no/dokument/LTI/forskrift/2024-06-24-1311. Forskriften eies av Forsvarsdepartementet. Forsvarsbygg ivaretar Forsvarets arealbruksinteresser i arealplansammenheng, og det er derfor Forsvarsbygg som distribuerer datasettet i Geonorge.
status: Sendt inn

Reindrift - Årstidsbeite - Høstbeite
type: Concept
in scheme: FAIR-register
top concept of: FAIR-register
definition: Høstbeite er ett av fem datasett som til sammen beskriver reindriftens årstidsbeiter. Det skilles mellom to typer høstbeite: Tidlig høstland og parringsland. Tidlig høstland er områder hvor reinen beiter tidlig på høsten, og hvor reinen på naturlig måte spres på leting etter sopp. Denne tida kalles ofte spredningstid. Parringsland er de deler av høstområdet som brukes i brunstperioden. Reindrift er en nomadisk næring med en syklisk veksling mellom beiter tilpasset reinens krav i den enkelte årstid. Et reindriftsår er inndelt i fem ulike årstider med tilhørende årstidsbeiter. Årlige variasjonene i blant annet vær- og beiteforhold gjør at bruken av årstidsbeitene vil variere i både tid og utstrekning fra år til år.
description: Høstbeite er ett av fem datasett som til sammen beskriver reindriftens årstidsbeiter. Det skilles mellom to typer høstbeite: Tidlig høstland og parringsland. Tidlig høstland er områder hvor reinen beiter tidlig på høsten, og hvor reinen på naturlig måte spres på leting etter sopp. Denne tida kalles ofte spredningstid. Parringsland er de deler av høstområdet som brukes i brunstperioden. Reindrift er en nomadisk næring med en syklisk veksling mellom beiter tilpasset reinens krav i den enkelte årstid. Et reindriftsår er inndelt i fem ulike årstider med tilhørende årstidsbeiter. Årlige variasjonene i blant annet vær- og beiteforhold gjør at bruken av årstidsbeitene vil variere i både tid og utstrekning fra år til år.
status: Sendt inn

Forsvarets skyte- og øvingsfelt land
type: Concept
in scheme: FAIR-register
top concept of: FAIR-register
definition: Datasettet inneholder den flatemessige utbredelsen av militære skyte- og øvingsfelt avgrenset av Forsvarets eide/leide grunn, og Forsvarets ervervede rettigheter til bruk av arealet til skyte- og øvingsaktivitet, herunder også klausulerte fareområder (sikkerhetssoner). Datasettet beskriver IKKE fare-/restriksjonsområder for luftfarten som kan avvike fra skytefeltets geografiske representasjon på bakken. Datasettet inneholder kun skytefelt som er forvaltet av Forsvarsbygg. Skytefelt i sjø forvaltes primært av Sjøforsvaret, og er ikke med i dette datasettet. Deler av dette datasettet leveres også til Kartverkets N50-serie.
description: Datasettet inneholder den flatemessige utbredelsen av militære skyte- og øvingsfelt avgrenset av Forsvarets eide/leide grunn, og Forsvarets ervervede rettigheter til bruk av arealet til skyte- og øvingsaktivitet, herunder også klausulerte fareområder (sikkerhetssoner). Datasettet beskriver IKKE fare-/restriksjonsområder for luftfarten som kan avvike fra skytefeltets geografiske representasjon på bakken. Datasettet inneholder kun skytefelt som er forvaltet av Forsvarsbygg. Skytefelt i sjø forvaltes primært av Sjøforsvaret, og er ikke med i dette datasettet. Deler av dette datasettet leveres også til Kartverkets N50-serie.
status: Sendt inn

Norges maritime grenser
type: Concept
in scheme: FAIR-register
top concept of: FAIR-register
definition: Norges maritime grenser er en samlebetegnelse for grenser og soner i havområder som inngår i Norges lover og forskrifter. Grensene og områdene er sammenstilt i et offisielt vektordatasett som dekker områdene Fastlands-Norge, Jan Mayen og Svalbard, samt Bouvetøya.
description: Norges maritime grenser er en samlebetegnelse for grenser og soner i havområder som inngår i Norges lover og forskrifter. Grensene og områdene er sammenstilt i et offisielt vektordatasett som dekker områdene Fastlands-Norge, Jan Mayen og Svalbard, samt Bouvetøya.
status: Sendt inn

Reindrift - Samebyrettsavgjørelse
type: Concept
in scheme: FAIR-register
top concept of: FAIR-register
definition: Samebyrettsavgjørelse viser grenser for svenske reineieres (samebyers) beiteområder i Norge, fastsatt i rettsavgjørelser. Samebyer i Sverige er økonomiske og administrative enheter med eget styre, i likhet med reinbeitedistrikter i Norge. Datasettet anbefales brukt sammen med to andre datasett som viser svenske reineieres rettigheter i Norge, “Reindrift - Konvensjonsområde” og “Reindrift - Samebyavtale”. Reindrift er en nomadisk næring med en syklisk veksling mellom beiter tilpasset reinens krav i den enkelte årstid. Årlige variasjoner i blant annet vær- og beiteforhold gjør at bruken av årstidsbeitene vil variere i både tid og utstrekning fra år til år.
description: Samebyrettsavgjørelse viser grenser for svenske reineieres (samebyers) beiteområder i Norge, fastsatt i rettsavgjørelser. Samebyer i Sverige er økonomiske og administrative enheter med eget styre, i likhet med reinbeitedistrikter i Norge. Datasettet anbefales brukt sammen med to andre datasett som viser svenske reineieres rettigheter i Norge, “Reindrift - Konvensjonsområde” og “Reindrift - Samebyavtale”. Reindrift er en nomadisk næring med en syklisk veksling mellom beiter tilpasset reinens krav i den enkelte årstid. Årlige variasjoner i blant annet vær- og beiteforhold gjør at bruken av årstidsbeitene vil variere i både tid og utstrekning fra år til år.
status: Sendt inn

Reindrift - Beitehage
type: Concept
in scheme: FAIR-register
top concept of: FAIR-register
definition: Beitehage er områder som er helt eller delvis inngjerdet med trådstengsel. Her samles flokken før den tas inn i et arbeidsgjerde for kalvemerking, uttak av slaktedyr eller i påvente av transport. Der hvor beitehagen er delvis inngjerdet med trådstengsel er det i tillegg naturlige stengsler som berg, innsjø eller elv som avgrenser beitehagen. Kartene er å regne som illustrasjon på hvordan reindriftsnæringen i hovedsak og normalt bruker områdene. Lov om reindrift (reindriftsloven) regulerer hvilke rettigheter og plikter reindriftsutøvere har i forhold til arealbruk.
description: Beitehage er områder som er helt eller delvis inngjerdet med trådstengsel. Her samles flokken før den tas inn i et arbeidsgjerde for kalvemerking, uttak av slaktedyr eller i påvente av transport. Der hvor beitehagen er delvis inngjerdet med trådstengsel er det i tillegg naturlige stengsler som berg, innsjø eller elv som avgrenser beitehagen. Kartene er å regne som illustrasjon på hvordan reindriftsnæringen i hovedsak og normalt bruker områdene. Lov om reindrift (reindriftsloven) regulerer hvilke rettigheter og plikter reindriftsutøvere har i forhold til arealbruk.
status: Sendt inn

Reindrift - Siidaområde
type: Concept
in scheme: FAIR-register
top concept of: FAIR-register
definition: Datasettet avgrenser siidaer i det samiske reinbeiteområdet. En siida er en gruppe av reineiere som utøver reindrift i fellesskap på bestemte arealer. Det finnes sommersiidaer og vintersiidaer. De siste årene har det vært i underkant av 100 sommersiidaer, og om lag 150 vintersiidaer i det samiske reinbeiteområdet. En siida består av en eller flere siidaandeler, hvor hver siidaandel har en ansvarlig leder.
description: Datasettet avgrenser siidaer i det samiske reinbeiteområdet. En siida er en gruppe av reineiere som utøver reindrift i fellesskap på bestemte arealer. Det finnes sommersiidaer og vintersiidaer. De siste årene har det vært i underkant av 100 sommersiidaer, og om lag 150 vintersiidaer i det samiske reinbeiteområdet. En siida består av en eller flere siidaandeler, hvor hver siidaandel har en ansvarlig leder.
status: Sendt inn

Aktsomhetskart svakhetssoner i fjell
type: Concept
in scheme: FAIR-register
top concept of: FAIR-register
definition: Aktsomhetskart svakhetssoner i fjell viser områder hvor det er sannsynlig eller mindre sannsynlig at det forekommer svakhetssoner i fjellet, som er forårsaket av leiromvandling. Kartet er et hjelpemiddel ved planlegging av tunneler, fjellhaller og lignende anlegg i fjell. Kartet viser fire klasser basert på sannsynlighet for at det skal forekomme svakhetssoner i fjell. Kartet er utarbeidet ved å samtolke (korrelere) magnetiske data målt fra fly og helikopter og digital terrengmodell. Der begge disse datasettene viser lave verdier, kan det indikere dypforvitrede soner som kan forårsake problemer under anleggsfase og etter ferdigstilling av et utbyggingstiltak. Datasettet er ikke landsdekkende. Det nye aktsomhetskartet dekker kystområdene i Sør-Norge og store deler av Midt-Norge.
description: Aktsomhetskart svakhetssoner i fjell viser områder hvor det er sannsynlig eller mindre sannsynlig at det forekommer svakhetssoner i fjellet, som er forårsaket av leiromvandling. Kartet er et hjelpemiddel ved planlegging av tunneler, fjellhaller og lignende anlegg i fjell. Kartet viser fire klasser basert på sannsynlighet for at det skal forekomme svakhetssoner i fjell. Kartet er utarbeidet ved å samtolke (korrelere) magnetiske data målt fra fly og helikopter og digital terrengmodell. Der begge disse datasettene viser lave verdier, kan det indikere dypforvitrede soner som kan forårsake problemer under anleggsfase og etter ferdigstilling av et utbyggingstiltak. Datasettet er ikke landsdekkende. Det nye aktsomhetskartet dekker kystområdene i Sør-Norge og store deler av Midt-Norge.
status: Sendt inn

Statlige planretningslinjer for differensiert forvaltning av strandsonen langs sjøen
type: Concept
in scheme: FAIR-register
top concept of: FAIR-register
definition: Tjenesten/datasettet viser statlige planretningslinjer for differensiert forvaltning av strandsonen langs sjøen. Planretningslinjen gjelder i 100-metersbeltet innenfor kystkonturen. Forbud mot tiltak i strandsonen er utdypet med Statlige planretningslinjer for differensiert forvaltning av strandsonen langs sjøen. Datasettet viser hvor strengt forbudet skal håndheves i den enkelte kommune. Datasettet er ikke juridisk, men er et planrelevant datasett og inngår i DOK. Det skal brukes til se hvilken sone den enkelte kommune ligger i når det gjelder håndheving av forbudet mot bygging i strandsonen.
description: Tjenesten/datasettet viser statlige planretningslinjer for differensiert forvaltning av strandsonen langs sjøen. Planretningslinjen gjelder i 100-metersbeltet innenfor kystkonturen. Forbud mot tiltak i strandsonen er utdypet med Statlige planretningslinjer for differensiert forvaltning av strandsonen langs sjøen. Datasettet viser hvor strengt forbudet skal håndheves i den enkelte kommune. Datasettet er ikke juridisk, men er et planrelevant datasett og inngår i DOK. Det skal brukes til se hvilken sone den enkelte kommune ligger i når det gjelder håndheving av forbudet mot bygging i strandsonen.
status: Sendt inn

Vindkraftverk
type: Concept
in scheme: FAIR-register
top concept of: FAIR-register
definition: Datasettet gir en samlet oversikt over konsesjonspliktige vindkraftverk som NVE har ferdigbehandlet eller som er under behandling. Dataene gir også en oversikt over konsesjonspliktige vindkraftverk som er helt eller delvis bygget og idriftsatt.
description: Datasettet gir en samlet oversikt over konsesjonspliktige vindkraftverk som NVE har ferdigbehandlet eller som er under behandling. Dataene gir også en oversikt over konsesjonspliktige vindkraftverk som er helt eller delvis bygget og idriftsatt.
status: Sendt inn

Dybdedata - terrengmodeller 25 meters grid
type: Concept
in scheme: FAIR-register
top concept of: FAIR-register
definition: Datasettet viser terrengvariasjoner på havbunnen. Terrengmodellene har blitt produsert av innsamlede sjømålingsdata av høy kvalitet. Dekningsområdet er avhengig av kartleggingen i forbindelse med MAREANO programmet. MAREANO har kartlagt havområdene utenfor Møre og Romsdal, Trøndelag, Nordland, Troms, Finnmark, Barentshavet øst og ellers utvalgte områder ved Svalbard. Dekningsområdet utvides kontinuerlig etterhvert som nye områder blir kartlagt. Oppløsningen på terrengmodellene er 25m x 25m. Terrengmodellene tilbys i UTM sone 33 og geografisk WGS84. Det innebærer at enkelte kartdata ikke ligger i den UTM-sonen som dekker det aktuelle området.
description: Datasettet viser terrengvariasjoner på havbunnen. Terrengmodellene har blitt produsert av innsamlede sjømålingsdata av høy kvalitet. Dekningsområdet er avhengig av kartleggingen i forbindelse med MAREANO programmet. MAREANO har kartlagt havområdene utenfor Møre og Romsdal, Trøndelag, Nordland, Troms, Finnmark, Barentshavet øst og ellers utvalgte områder ved Svalbard. Dekningsområdet utvides kontinuerlig etterhvert som nye områder blir kartlagt. Oppløsningen på terrengmodellene er 25m x 25m. Terrengmodellene tilbys i UTM sone 33 og geografisk WGS84. Det innebærer at enkelte kartdata ikke ligger i den UTM-sonen som dekker det aktuelle området.
status: Sendt inn

FKB-Høydekurve
type: Concept
in scheme: FAIR-register
top concept of: FAIR-register
definition: FKB-Høydekurve er en del av Felles Kartdatabase (FKB). FKB er en samling datasett som utgjør en sentral del av grunnkartet. Se metadataoppføring for Felles Kartdatabase for mer info. FKB-Høydekurve omfatter data som er nødvendig for å beskrive terrengets form og høyde over et gitt referansenivå. Objekttypene høydekurve, forsenkningskurve, toppunkt, forsenkningspunkt, terrengpunkt og terrenglinje omfattes av spesifikasjonen. Nye høydekurver genereres hovedsaklig fra en terrengmodell basert på punktskyer fra laserskanning. Høydekurvene blir da bare en visning av terrengmodellen. Best informasjon om terrenget fås ved direkte bruk av terrengmodellen. FKB-data er ikke-sensistive og åpne data. FKB-dataene er finansiert gjennom Geovekst-samarbeidet, eller kommunene alene for kommuner som står utenfor Geovekst. FKB-dataene er fritt tilgjengelige for Norge digitalt parter og kan lastes ned gjennom nedlastingsløsningen på Geonorge. Private aktører må kjøpe tilgang til dataene gjennom en forhandler.
description: FKB-Høydekurve er en del av Felles Kartdatabase (FKB). FKB er en samling datasett som utgjør en sentral del av grunnkartet. Se metadataoppføring for Felles Kartdatabase for mer info. FKB-Høydekurve omfatter data som er nødvendig for å beskrive terrengets form og høyde over et gitt referansenivå. Objekttypene høydekurve, forsenkningskurve, toppunkt, forsenkningspunkt, terrengpunkt og terrenglinje omfattes av spesifikasjonen. Nye høydekurver genereres hovedsaklig fra en terrengmodell basert på punktskyer fra laserskanning. Høydekurvene blir da bare en visning av terrengmodellen. Best informasjon om terrenget fås ved direkte bruk av terrengmodellen. FKB-data er ikke-sensistive og åpne data. FKB-dataene er finansiert gjennom Geovekst-samarbeidet, eller kommunene alene for kommuner som står utenfor Geovekst. FKB-dataene er fritt tilgjengelige for Norge digitalt parter og kan lastes ned gjennom nedlastingsløsningen på Geonorge. Private aktører må kjøpe tilgang til dataene gjennom en forhandler.
status: Sendt inn

Reindrift - Årstidsbeite - Sommerbeite
type: Concept
in scheme: FAIR-register
top concept of: FAIR-register
definition: Sommerbeite er ett av fem datasett som til sammen beskriver reindriftens årstidsbeiter. Sommerbeite beskriver områder som reinen bruker på sommeren, og det skilles mellom høysommerland og lavereliggende sommerland. Høyereliggende områder og luftingsområder er områder hvor reinen oppholder seg i varme perioder om sommeren for å dekke sitt behov for beite, ro, avkjøling og minske insektsplagen. Reinen finner som regel slike områder høyere til fjells, og derfor kalles dette ofte høysommerland. I vær- og vindeksponerte kystområder kan områder med høysommerland-funksjon også være i lavereliggende terreng. Lavereliggende sommerland er områder i tilknytning til høysommerland. I sommerperioden er reinen var for temperatursvingninger og insektsplage, på grunn av at den røyter de gamle hårene og skal danne nytt hårlag. Reinen har derfor behov for å kunne bevege seg mellom høyereliggende og lavereliggende områder, for å finne ro til å beite. Reindrift er en nomadisk næring med en syklisk veksling mellom beiter tilpasset reinens krav i den enkelte årstid. Et reindriftsår er inndelt i fem ulike årstider med tilhørende årstidsbeiter. Årlige variasjonene iblant annet vær- og beiteforhold gjør at bruken av årstidsbeitene vil variere i både tid og utstrekning fra år til år.
description: Sommerbeite er ett av fem datasett som til sammen beskriver reindriftens årstidsbeiter. Sommerbeite beskriver områder som reinen bruker på sommeren, og det skilles mellom høysommerland og lavereliggende sommerland. Høyereliggende områder og luftingsområder er områder hvor reinen oppholder seg i varme perioder om sommeren for å dekke sitt behov for beite, ro, avkjøling og minske insektsplagen. Reinen finner som regel slike områder høyere til fjells, og derfor kalles dette ofte høysommerland. I vær- og vindeksponerte kystområder kan områder med høysommerland-funksjon også være i lavereliggende terreng. Lavereliggende sommerland er områder i tilknytning til høysommerland. I sommerperioden er reinen var for temperatursvingninger og insektsplage, på grunn av at den røyter de gamle hårene og skal danne nytt hårlag. Reinen har derfor behov for å kunne bevege seg mellom høyereliggende og lavereliggende områder, for å finne ro til å beite. Reindrift er en nomadisk næring med en syklisk veksling mellom beiter tilpasset reinens krav i den enkelte årstid. Et reindriftsår er inndelt i fem ulike årstider med tilhørende årstidsbeiter. Årlige variasjonene iblant annet vær- og beiteforhold gjør at bruken av årstidsbeitene vil variere i både tid og utstrekning fra år til år.
status: Sendt inn

N20 Kartdata
type: Concept
in scheme: FAIR-register
top concept of: FAIR-register
definition: N20 Kartdata er basert på utvalgte og generaliserte FKB data. Informasjonen er ytterligere generalisert i forhold til N5 Kartdata. Temagrupper N20 Kartdata: Høyde: Høydekurver (ekvidistanse 10 meter) og høydepunkt. Vann: Kyst, sjø, innsjø og vassdrag. Administrative grenser: Administrasjonsgrenser, eiendomsinformasjon, servituttgrenser, verneområder og kulturminner. Markslag: Markslaginformasjon. Areal: Arealbruk. Bygg og anlegg: Utvalgte bygningstyper, bygningsmessige anlegg og ledninger. Samferdsel: Silt/tynnet VBASE, jernbane, annen samferdsel og lufthavn. Tekst: Utvalgte presentasjonsdata.
description: N20 Kartdata er basert på utvalgte og generaliserte FKB data. Informasjonen er ytterligere generalisert i forhold til N5 Kartdata. Temagrupper N20 Kartdata: Høyde: Høydekurver (ekvidistanse 10 meter) og høydepunkt. Vann: Kyst, sjø, innsjø og vassdrag. Administrative grenser: Administrasjonsgrenser, eiendomsinformasjon, servituttgrenser, verneområder og kulturminner. Markslag: Markslaginformasjon. Areal: Arealbruk. Bygg og anlegg: Utvalgte bygningstyper, bygningsmessige anlegg og ledninger. Samferdsel: Silt/tynnet VBASE, jernbane, annen samferdsel og lufthavn. Tekst: Utvalgte presentasjonsdata.
status: Sendt inn

Friluftslivsområder - kartlagte
type: Concept
in scheme: FAIR-register
top concept of: FAIR-register
definition: Datasettet viser områder som er kartlagt og verdsatt etter metodikken i Miljødirektoratets Veileder M98-2013 (Tidligere DN håndbok 25 – 2004 Kartlegging og verdsetting av friluftslivsområder). Formålet med datasettet er å gi en oversikt over områder som er viktige for allmennhetens friluftsliv, og at det skal være lett å redegjøre for hvilke vurderinger og kriterier som er lagt til grunn for arbeidet og det ferdige produktet.
description: Datasettet viser områder som er kartlagt og verdsatt etter metodikken i Miljødirektoratets Veileder M98-2013 (Tidligere DN håndbok 25 – 2004 Kartlegging og verdsetting av friluftslivsområder). Formålet med datasettet er å gi en oversikt over områder som er viktige for allmennhetens friluftsliv, og at det skal være lett å redegjøre for hvilke vurderinger og kriterier som er lagt til grunn for arbeidet og det ferdige produktet.
status: Sendt inn

N20 Bygning
type: Concept
in scheme: FAIR-register
top concept of: FAIR-register
definition: N20 Bygning inneholder alle bygninger med bygningsomriss tilpasset målestokk 1:20000
description: N20 Bygning inneholder alle bygninger med bygningsomriss tilpasset målestokk 1:20000
status: Sendt inn

Hovedled og Biled, arealavgrensning
type: Concept
in scheme: FAIR-register
top concept of: FAIR-register
definition: Farleden er gitt gjennom Forskrift om farleder (farledsforskriften). Hele norskekysten er i dag dekket av et standardisert referansesystem av ulike farledskategorier. Farledsstrukturen omfatter nettverket av sjøverts transportårer og er et nasjonalt geografisk referansesystem for tiltak innen forvaltning, planlegging, utbygging og operativ virksomhet i kystsonen. Mer om farledsstrukturen: http://www.kystverket.no/Maritim-infrastruktur/Farleder/Farledsstrukturen/ Datasettet viser hoved- og biledenes arealmessige utstrekning.
description: Farleden er gitt gjennom Forskrift om farleder (farledsforskriften). Hele norskekysten er i dag dekket av et standardisert referansesystem av ulike farledskategorier. Farledsstrukturen omfatter nettverket av sjøverts transportårer og er et nasjonalt geografisk referansesystem for tiltak innen forvaltning, planlegging, utbygging og operativ virksomhet i kystsonen. Mer om farledsstrukturen: http://www.kystverket.no/Maritim-infrastruktur/Farleder/Farledsstrukturen/ Datasettet viser hoved- og biledenes arealmessige utstrekning.
status: Sendt inn

Forsvarets skyte- og øvingsfelt i sjø
type: Concept
in scheme: FAIR-register
top concept of: FAIR-register
definition: Datasettet Skyte- og øvingsfelt (SØF) i sjø viser skyte- og øvingsområder som Forsvaret bruker til sjøs. Forsvarets skyte- og øvingsfelt er tilrettelagte områder hvor Forsvaret kan skyte, øve og trene operasjoner i alle dimensjoner; luftrom, overflate og under vann. Datasettet viser eksisterende og nye skyte- og øvingsfelt (SØF) i høringsforslag av 13.sept. 2021 til ny forskrift om skyte- og øvingsfelt i sjø. Datasettet Forsvarets skyte- og øvingsfelt i sjø – anbefalt avviklet viser skytefelt som i høringsforslag av 13.sept. 2021 har status anbefalt avviklet. Datasettet inneholder den geografiske avgrensningen av feltene på overflaten. Datasettet beskriver ikke fare-/restriksjonsområder for luftfarten, som kan avvike fra skytefeltets geografiske representasjon på overflaten.
description: Datasettet Skyte- og øvingsfelt (SØF) i sjø viser skyte- og øvingsområder som Forsvaret bruker til sjøs. Forsvarets skyte- og øvingsfelt er tilrettelagte områder hvor Forsvaret kan skyte, øve og trene operasjoner i alle dimensjoner; luftrom, overflate og under vann. Datasettet viser eksisterende og nye skyte- og øvingsfelt (SØF) i høringsforslag av 13.sept. 2021 til ny forskrift om skyte- og øvingsfelt i sjø. Datasettet Forsvarets skyte- og øvingsfelt i sjø – anbefalt avviklet viser skytefelt som i høringsforslag av 13.sept. 2021 har status anbefalt avviklet. Datasettet inneholder den geografiske avgrensningen av feltene på overflaten. Datasettet beskriver ikke fare-/restriksjonsområder for luftfarten, som kan avvike fra skytefeltets geografiske representasjon på overflaten.
status: Sendt inn

Støysoner Avinors lufthavner
type: Concept
in scheme: FAIR-register
top concept of: FAIR-register
definition: Datasettet gir opplysninger om støy i innflyvningssoner og støy ved bakken i tilknytning til flyplasser. Støysoner er behandlet iht. T-1442 Retningslinjer for behandling av støy i arealplanlegging, Miljøverndepartementet
description: Datasettet gir opplysninger om støy i innflyvningssoner og støy ved bakken i tilknytning til flyplasser. Støysoner er behandlet iht. T-1442 Retningslinjer for behandling av støy i arealplanlegging, Miljøverndepartementet
status: Sendt inn

Skredfaresoner
type: Concept
in scheme: FAIR-register
top concept of: FAIR-register
definition: NVE gjennomfører faresonekartlegging av skred i bratt terreng for utvalgte områder prioritert for kartlegging, jfr Plan for skredfarekartlegging (NVE rapport 14/2011).Kartleggingen dekker skredtypene snøskred, sørpeskred, steinsprang, jordskred og flomskred.
description: NVE gjennomfører faresonekartlegging av skred i bratt terreng for utvalgte områder prioritert for kartlegging, jfr Plan for skredfarekartlegging (NVE rapport 14/2011).Kartleggingen dekker skredtypene snøskred, sørpeskred, steinsprang, jordskred og flomskred.
status: Sendt inn

Befolkning på rutenett 1000 m 2025
type: Concept
in scheme: FAIR-register
top concept of: FAIR-register
definition: Viser bosatte på ruter 1000 m x 1000 m for 2025. Grunnlaget for dataene er folkeregistrert befolkning knyttet mot adressepunkter i Matrikkelen. Dette er summert til rutenett.
description: Viser bosatte på ruter 1000 m x 1000 m for 2025. Grunnlaget for dataene er folkeregistrert befolkning knyttet mot adressepunkter i Matrikkelen. Dette er summert til rutenett.
status: Sendt inn

Friluftslivsområder - statlig sikra
type: Concept
in scheme: FAIR-register
top concept of: FAIR-register
definition: Datasettet viser områder som er sikra for allmenne friluftslivsformål ved statlig hjelp. Dette innebærer at staten v/ Miljødirektoratet har skaffet seg råderett over arealet. Råderetten kan ha form av at området er kjøpt av staten, ved at området omfattes av en langsiktig avtale om bruksrett (servituttavtale) eller ved at staten sitter med en tinglyst erklæring om bruk til friluftslivsformål.
description: Datasettet viser områder som er sikra for allmenne friluftslivsformål ved statlig hjelp. Dette innebærer at staten v/ Miljødirektoratet har skaffet seg råderett over arealet. Råderetten kan ha form av at området er kjøpt av staten, ved at området omfattes av en langsiktig avtale om bruksrett (servituttavtale) eller ved at staten sitter med en tinglyst erklæring om bruk til friluftslivsformål.
status: Sendt inn

Dybdedata - terrengmodeller 5 meters grid
type: Concept
in scheme: FAIR-register
top concept of: FAIR-register
definition: Datasettet viser terrengvariasjoner på havbunnen. Terrengmodellene har blitt produsert av innsamlede sjømålingsdata av høy kvalitet. Dekningsområdet er avhengig av kartleggingen i forbindelse med MAREANO programmet. MAREANO har kartlagt havområdene utenfor Møre og Romsdal, Trøndelag, Nordland, Troms, Finnmark, Barentshavet øst og ellers utvalgte områder ved Svalbard. Dekningsområdet utvides kontinuerlig etterhvert som nye områder blir kartlagt. Oppløsningen på terrengmodellene er 5m x 5m. Terrengmodellene tilbys i UTM sone 33 og geografisk WGS84. Det innebærer at enkelte kartdata ikke ligger i den UTM-sonen som dekker det aktuelle området.
description: Datasettet viser terrengvariasjoner på havbunnen. Terrengmodellene har blitt produsert av innsamlede sjømålingsdata av høy kvalitet. Dekningsområdet er avhengig av kartleggingen i forbindelse med MAREANO programmet. MAREANO har kartlagt havområdene utenfor Møre og Romsdal, Trøndelag, Nordland, Troms, Finnmark, Barentshavet øst og ellers utvalgte områder ved Svalbard. Dekningsområdet utvides kontinuerlig etterhvert som nye områder blir kartlagt. Oppløsningen på terrengmodellene er 5m x 5m. Terrengmodellene tilbys i UTM sone 33 og geografisk WGS84. Det innebærer at enkelte kartdata ikke ligger i den UTM-sonen som dekker det aktuelle området.
status: Sendt inn

Geologisk arv
type: Concept
in scheme: FAIR-register
top concept of: FAIR-register
definition: Datasettet Geologisk arv viser geologiske lokaliteter av særlig verdi for undervisning, forskning og/eller formidling (geosteder). Det inneholder data innsamlet til ulike formål over lang tid, delvis digitalisert ved NGU fra analoge data, delvis innsamlet i nyere tid. Det inkluderer både geosteder av stor utstrekning (landskapselementer) og små lokaliteter. Beskrivelsene er innsamlet til ulik tid og med forskjellige metoder og er derfor av varierende kvalitet. Verdivurderinger som er presentert, er alle gjort i henhold til metodikk lansert i KU-veilederen til Miljødirektoratet 2020. I kartinnsyn er dataene ledsaget av faktaark med utførlige beskrivelser av geosteder. For mer informasjon om hvordan man går fram for å vurdere geologisk mangfold i arealplanlegging og i en konsekvensutredningsprosess; https://www.ngu.no/emne/geologisk-mangfold-1
description: Datasettet Geologisk arv viser geologiske lokaliteter av særlig verdi for undervisning, forskning og/eller formidling (geosteder). Det inneholder data innsamlet til ulike formål over lang tid, delvis digitalisert ved NGU fra analoge data, delvis innsamlet i nyere tid. Det inkluderer både geosteder av stor utstrekning (landskapselementer) og små lokaliteter. Beskrivelsene er innsamlet til ulik tid og med forskjellige metoder og er derfor av varierende kvalitet. Verdivurderinger som er presentert, er alle gjort i henhold til metodikk lansert i KU-veilederen til Miljødirektoratet 2020. I kartinnsyn er dataene ledsaget av faktaark med utførlige beskrivelser av geosteder. For mer informasjon om hvordan man går fram for å vurdere geologisk mangfold i arealplanlegging og i en konsekvensutredningsprosess; https://www.ngu.no/emne/geologisk-mangfold-1
status: Sendt inn

Gyteområder
type: Concept
in scheme: FAIR-register
top concept of: FAIR-register
definition: Datasettet viser områder hvor det blir fanget gytefisk, hvilken art og gyteperiode. Opplysningene er basert på intervju av i fiskere, dvs at det inneholder opplysninger om kommersielle arter
description: Datasettet viser områder hvor det blir fanget gytefisk, hvilken art og gyteperiode. Opplysningene er basert på intervju av i fiskere, dvs at det inneholder opplysninger om kommersielle arter
status: Sendt inn

N50 Kartdata
type: Concept
in scheme: FAIR-register
top concept of: FAIR-register
definition: Kartdata tilpasset målestokkområdet 1:25 000 til 1:100 000. Produktet har et innhold som tilsvarer papirkartserien Norge 1:50 000 med unntak av bathymetri (dybder). Temaer som inngår i produktet er arealdekke (vann, markslag, etc.), administrative områder, bygninger og anlegg, høyde, restriksjonsområder, samferdsel og stedsnavn. N50 Kartdata dekker fastlands-Norge og er begrenset av riksgrensen mot nabolandene og territorialgrensen i havet. Produktet er kartografisk redigert med tanke på presentasjon i målestokk 1:50 000. N50 Kartdata ajourføres kontinuerlig og distribueres ukentlig.
description: Kartdata tilpasset målestokkområdet 1:25 000 til 1:100 000. Produktet har et innhold som tilsvarer papirkartserien Norge 1:50 000 med unntak av bathymetri (dybder). Temaer som inngår i produktet er arealdekke (vann, markslag, etc.), administrative områder, bygninger og anlegg, høyde, restriksjonsområder, samferdsel og stedsnavn. N50 Kartdata dekker fastlands-Norge og er begrenset av riksgrensen mot nabolandene og territorialgrensen i havet. Produktet er kartografisk redigert med tanke på presentasjon i målestokk 1:50 000. N50 Kartdata ajourføres kontinuerlig og distribueres ukentlig.
status: Sendt inn

Lufthavn - Restriksjonsplaner for Avinors lufthavner
type: Concept
in scheme: FAIR-register
top concept of: FAIR-register
definition: Restriksjonsplanen produseres for å vise de begrensninger og rådighetsinnskrenkninger som er nødvendig for å sikre hinderfritt luftrom for flytrafikken for Avinors lufthavner. Flater har høydeverdi og kan brukes til 3D-modellering.
description: Restriksjonsplanen produseres for å vise de begrensninger og rådighetsinnskrenkninger som er nødvendig for å sikre hinderfritt luftrom for flytrafikken for Avinors lufthavner. Flater har høydeverdi og kan brukes til 3D-modellering.
status: Sendt inn

Befolkning på rutenett 250 m 2025
type: Concept
in scheme: FAIR-register
top concept of: FAIR-register
definition: Bosatte på ruter 250 * 250 meter i 2025. Grunnlaget for dataene er folkeregistrert befolkning knyttet mot adressepunkter i Matrikkelen. Dette er summert til rutenett.
description: Bosatte på ruter 250 * 250 meter i 2025. Grunnlaget for dataene er folkeregistrert befolkning knyttet mot adressepunkter i Matrikkelen. Dette er summert til rutenett.
status: Sendt inn

Reindrift - Konvensjonsområde
type: Concept
in scheme: FAIR-register
top concept of: FAIR-register
definition: Datasettet viser administrative grenser for svenske reineieres (samebyers) beiteområder i Norge, fastsatt i forskrift om beiteområder for svensk rein i Norge, jf. grensereinbeiteloven. Samebyer i Sverige er økonomiske og administrative enheter med eget styre, i likhet med reinbeitedistrikter i Norge. Konvensjonsområde anbefales brukt sammen med to andre datasett som viser svenske reineieres rettigheter i Norge, “Reindrift - Samebyrettsavgjørelse” og “Reindrift - Samebyavtale”. Reindrift er en nomadisk næring med en syklisk veksling mellom beiter tilpasset reinens krav i den enkelte årstid. Årlige variasjoner i blant annet vær- og beiteforhold gjør at bruken av årstidsbeitene vil variere i både tid og utstrekning fra år til år.
description: Datasettet viser administrative grenser for svenske reineieres (samebyers) beiteområder i Norge, fastsatt i forskrift om beiteområder for svensk rein i Norge, jf. grensereinbeiteloven. Samebyer i Sverige er økonomiske og administrative enheter med eget styre, i likhet med reinbeitedistrikter i Norge. Konvensjonsområde anbefales brukt sammen med to andre datasett som viser svenske reineieres rettigheter i Norge, “Reindrift - Samebyrettsavgjørelse” og “Reindrift - Samebyavtale”. Reindrift er en nomadisk næring med en syklisk veksling mellom beiter tilpasset reinens krav i den enkelte årstid. Årlige variasjoner i blant annet vær- og beiteforhold gjør at bruken av årstidsbeitene vil variere i både tid og utstrekning fra år til år.
status: Sendt inn

DTM 10 Terrengmodell (UTM33)
type: Concept
in scheme: FAIR-register
top concept of: FAIR-register
definition: Digital terrengmodell over fastlands-Norge med høyder i et rutenett på 10 x 10 meter. Terrengmodellen er en rutenettsmodell med oppløsning (rutenettstørrelse) på 10 x 10 meter. Nøyaktighet: ± 2 til 3 meter standardavvik i høyde avhengig av terreng og kartdataenes alder i FKB A – C-området. ± 4 til 6 meter standardavvik i høyde avhengig av terreng og kartdataenes alder utenfor FKB A – C-området. Arbeidet med ajourhold av dette datasettet blir ikke prioritert. De siste filene som ble oppdatert er fra 2013. Kartverket prioriterer isteden etablering av Nasjonal detaljert høydemodell (hoydedata.no), der nye høydemodeller tilgjengeliggjøres etter hvert som de blir produsert. På hoydedata.no finnes også ferdigproduserte eksporterer av landsdekkende terrengmodeller med 10 meters oppløsning. Disse er generert ut fra detaljerte laserdata der slike finnes. Dette suppleres med høydedata fra 2013-utgaven av DTM10 dersom det er nødvendig for å få full dekning.
description: Digital terrengmodell over fastlands-Norge med høyder i et rutenett på 10 x 10 meter. Terrengmodellen er en rutenettsmodell med oppløsning (rutenettstørrelse) på 10 x 10 meter. Nøyaktighet: ± 2 til 3 meter standardavvik i høyde avhengig av terreng og kartdataenes alder i FKB A – C-området. ± 4 til 6 meter standardavvik i høyde avhengig av terreng og kartdataenes alder utenfor FKB A – C-området. Arbeidet med ajourhold av dette datasettet blir ikke prioritert. De siste filene som ble oppdatert er fra 2013. Kartverket prioriterer isteden etablering av Nasjonal detaljert høydemodell (hoydedata.no), der nye høydemodeller tilgjengeliggjøres etter hvert som de blir produsert. På hoydedata.no finnes også ferdigproduserte eksporterer av landsdekkende terrengmodeller med 10 meters oppløsning. Disse er generert ut fra detaljerte laserdata der slike finnes. Dette suppleres med høydedata fra 2013-utgaven av DTM10 dersom det er nødvendig for å få full dekning.
status: Sendt inn

Markagrensen
type: Concept
in scheme: FAIR-register
top concept of: FAIR-register
definition: Datasettet avgrenser område for virkeområdet til lov 6. juni 2009 nr. 35 om naturområder i Oslo og nærliggende kommuner (markaloven) som trådte i kraft 1. september 2009. Markalovens virkeområde er fastsatt i forskrift 4. september 2015 nr. 1032 om justering av markagrensen fastlegger markalovens geografiske virkeområde med tilhørende kart. Stortinget vedtok mindre endringer i det tilhørende kartet 10. april 2019.
description: Datasettet avgrenser område for virkeområdet til lov 6. juni 2009 nr. 35 om naturområder i Oslo og nærliggende kommuner (markaloven) som trådte i kraft 1. september 2009. Markalovens virkeområde er fastsatt i forskrift 4. september 2015 nr. 1032 om justering av markagrensen fastlegger markalovens geografiske virkeområde med tilhørende kart. Stortinget vedtok mindre endringer i det tilhørende kartet 10. april 2019.
status: Sendt inn

Fiskeplasser - redskap
type: Concept
in scheme: FAIR-register
top concept of: FAIR-register
definition: Fiskeribruksområder - Arealavgrenset område hvor det drives fiske med med aktive redskap for eksempel snurrevad, snurpenot, reketrål, eller passive redskap som for eksempel garn og line. Informasjonen som er registrert er basert på intervju med fiskere.
description: Fiskeribruksområder - Arealavgrenset område hvor det drives fiske med med aktive redskap for eksempel snurrevad, snurpenot, reketrål, eller passive redskap som for eksempel garn og line. Informasjonen som er registrert er basert på intervju med fiskere.
status: Sendt inn

Vannforekomster
type: Concept
in scheme: FAIR-register
top concept of: FAIR-register
definition: Datasettet viser vannforekomster for overflatevann og grunnvann. En overflatevannforekomst er en betydelig mengde vann (tilsigsareal for elv og overflateareal for innsjø og kystvann). I tillegg til hydrografiske forhold defineres utstrekningen i henhold til kriterier for vanntype, påvirkninger, økologisk tilstand eller potensial (Sterkt modifiserte vannforekomster) og kjemisk tilstand. En grunnvannsforekomst defineres som en avgrenset forekomst som enten produserer 10m3 per døgn eller som kan forsyne 50 personer. Vannforekomstene utgjør forvaltningsenhetene som skal forvaltes i samsvar med bestemmelsene gitt i vannforskriften, der hovedhensikten er å sikre en helhetlig vannforvaltning fra fjell til fjord. Felles for elementene som inngår i vannforekomster, er at de er homogene med tanke på kjemiske, biologiske og fysiske egenskaper samt antropogene påvirkninger innenfor et nedbørfelt.
description: Datasettet viser vannforekomster for overflatevann og grunnvann. En overflatevannforekomst er en betydelig mengde vann (tilsigsareal for elv og overflateareal for innsjø og kystvann). I tillegg til hydrografiske forhold defineres utstrekningen i henhold til kriterier for vanntype, påvirkninger, økologisk tilstand eller potensial (Sterkt modifiserte vannforekomster) og kjemisk tilstand. En grunnvannsforekomst defineres som en avgrenset forekomst som enten produserer 10m3 per døgn eller som kan forsyne 50 personer. Vannforekomstene utgjør forvaltningsenhetene som skal forvaltes i samsvar med bestemmelsene gitt i vannforskriften, der hovedhensikten er å sikre en helhetlig vannforvaltning fra fjell til fjord. Felles for elementene som inngår i vannforekomster, er at de er homogene med tanke på kjemiske, biologiske og fysiske egenskaper samt antropogene påvirkninger innenfor et nedbørfelt.
status: Sendt inn

Reindrift - Avtaleområde
type: Concept
in scheme: FAIR-register
top concept of: FAIR-register
definition: Datasettet avgrenser områder hvor det i utgangspunktet ikke er reinbeiterettigheter, men hvor det er inngått avtale om reinbeite mellom grunneier og reindriftsutøver. Avtaleområder kan ligge både innenfor og utenfor det samiske reinbeiteområdet. Utenfor det samiske reinbeiteområdet er det krav om særskilt tillatelse til å utøve reindrift etter reindriftsloven § 8.
description: Datasettet avgrenser områder hvor det i utgangspunktet ikke er reinbeiterettigheter, men hvor det er inngått avtale om reinbeite mellom grunneier og reindriftsutøver. Avtaleområder kan ligge både innenfor og utenfor det samiske reinbeiteområdet. Utenfor det samiske reinbeiteområdet er det krav om særskilt tillatelse til å utøve reindrift etter reindriftsloven § 8.
status: Sendt inn

FKB-Arealbruk
type: Concept
in scheme: FAIR-register
top concept of: FAIR-register
definition: FKB-Arealbruk er en del av Felles Kartdatabase (FKB). FKB er en samling datasett som utgjør en sentral del av grunnkartet. Se metadataoppføring for Felles Kartdatabase for mer info. FKB-Arealbruk beskriver den fysiske bruken av et areal. Datasettet er ikke heldekkende. Markslagsbeskrivelser kartlegges i datasettet FKB-AR5 (arealtilstand, bonitet, markslag og mineralske råstoffer). Arealplandata (kommuneplaner, reguleringsplaner osv.) viser juridiske bestemmelser om hvordan et område skal disponeres. FKB-Arealbruk er viser altså en tredje type kartlegging av et areal der det fokuseres på den fysiske bruken av et geografisk område uavhengig av jordas produksjonsevne eller hva området er planlagt/bestemt brukt til. Eksempel på dette kan være et utbyggingsområde som i FKB-Arealbruk vil kodes som et anleggsområde, uavhengig av om dette arealstykke egner seg som fulldyrka areal og hva området er regulert til i plandataene. FKB-data er ikke-sensistive og åpne data. FKB-dataene er finansiert gjennom Geovekst-samarbeidet, eller kommunene alene for kommuner som står utenfor Geovekst. FKB-dataene er fritt tilgjengelige for Norge digitalt parter og kan lastes ned gjennom nedlastingsløsningen på Geonorge. Private aktører må kjøpe tilgang til dataene gjennom en forhandler.
description: FKB-Arealbruk er en del av Felles Kartdatabase (FKB). FKB er en samling datasett som utgjør en sentral del av grunnkartet. Se metadataoppføring for Felles Kartdatabase for mer info. FKB-Arealbruk beskriver den fysiske bruken av et areal. Datasettet er ikke heldekkende. Markslagsbeskrivelser kartlegges i datasettet FKB-AR5 (arealtilstand, bonitet, markslag og mineralske råstoffer). Arealplandata (kommuneplaner, reguleringsplaner osv.) viser juridiske bestemmelser om hvordan et område skal disponeres. FKB-Arealbruk er viser altså en tredje type kartlegging av et areal der det fokuseres på den fysiske bruken av et geografisk område uavhengig av jordas produksjonsevne eller hva området er planlagt/bestemt brukt til. Eksempel på dette kan være et utbyggingsområde som i FKB-Arealbruk vil kodes som et anleggsområde, uavhengig av om dette arealstykke egner seg som fulldyrka areal og hva området er regulert til i plandataene. FKB-data er ikke-sensistive og åpne data. FKB-dataene er finansiert gjennom Geovekst-samarbeidet, eller kommunene alene for kommuner som står utenfor Geovekst. FKB-dataene er fritt tilgjengelige for Norge digitalt parter og kan lastes ned gjennom nedlastingsløsningen på Geonorge. Private aktører må kjøpe tilgang til dataene gjennom en forhandler.
status: Sendt inn

Hovedled og Biled
type: Concept
in scheme: FAIR-register
top concept of: FAIR-register
definition: Farleden er gitt gjennom forskrift av 11. desember 2019 nr. 1834 (forskrift om farleder). Hele norskekysten er i dag dekket av et standardisert referansesystem av ulike farledskategorier. Farledsstrukturen omfatter nettverket av sjøverts transportårer og er et nasjonalt geografisk referansesystem for tiltak innen forvaltning, planlegging, utbygging og operativ virksomhet i kystsonen. Mer om farledsstrukturen: http://www.kystverket.no/Maritim-infrastruktur/Farleder /Farledsstrukturen/
description: Farleden er gitt gjennom forskrift av 11. desember 2019 nr. 1834 (forskrift om farleder). Hele norskekysten er i dag dekket av et standardisert referansesystem av ulike farledskategorier. Farledsstrukturen omfatter nettverket av sjøverts transportårer og er et nasjonalt geografisk referansesystem for tiltak innen forvaltning, planlegging, utbygging og operativ virksomhet i kystsonen. Mer om farledsstrukturen: http://www.kystverket.no/Maritim-infrastruktur/Farleder /Farledsstrukturen/
status: Sendt inn

Naturtyper på land og i ferskvann (HB13)
type: Concept
in scheme: FAIR-register
top concept of: FAIR-register
definition: Datasettet er tidligere publisert under navnet "Naturtyper - DN-håndbok 13". Datasettet viser naturtypelokaliteter på land og i ferskvann, kartlagt etter DN-håndbok 13. Den enkelte lokalitet er registrert med en naturtype, som kan være registrert mer detaljert i form av utforminger. Hver naturtype er beskrevet i DN-håndbok 13, med utgangspunkt i gjeldende beskrivelse av den eller de truede vegetasjonstypene som vanligvis vil inngå. Rødlistede naturtyper fra 2011 er lagt inn som naturtype eller utforming med samme betegnelse som er brukt i rødlista. Hver registrert lokalitet er gitt en naturfaglig verdi, basert på tilstand og naturmangfold. Lokalitetene har en mer eller mindre omfattende områdebeskrivelse. Presisjon i avgrensing er varierende, noe som også følger av at krav til presisjon har endret seg i årenes løp. Generelt vil nyere data være mer presist avgrenset enn eldre data, men datasettet inneholder også eldre data med god presisjon.
description: Datasettet er tidligere publisert under navnet "Naturtyper - DN-håndbok 13". Datasettet viser naturtypelokaliteter på land og i ferskvann, kartlagt etter DN-håndbok 13. Den enkelte lokalitet er registrert med en naturtype, som kan være registrert mer detaljert i form av utforminger. Hver naturtype er beskrevet i DN-håndbok 13, med utgangspunkt i gjeldende beskrivelse av den eller de truede vegetasjonstypene som vanligvis vil inngå. Rødlistede naturtyper fra 2011 er lagt inn som naturtype eller utforming med samme betegnelse som er brukt i rødlista. Hver registrert lokalitet er gitt en naturfaglig verdi, basert på tilstand og naturmangfold. Lokalitetene har en mer eller mindre omfattende områdebeskrivelse. Presisjon i avgrensing er varierende, noe som også følger av at krav til presisjon har endret seg i årenes løp. Generelt vil nyere data være mer presist avgrenset enn eldre data, men datasettet inneholder også eldre data med god presisjon.
status: Sendt inn

Matrikkelen - Adresse
type: Concept
in scheme: FAIR-register
top concept of: FAIR-register
definition: Offisielle fysiske adresser registrert i Matrikkelen (Norges offisielle eiendomsregister). En offisiell adresse er den fullstendige adressen for en bygning, bygningsdel, bruksenhet, eiendom eller et annet objekt. En adresse er enten Vegadresse (Storgata 10) eller Matrikkeladresse (33/2-2). Det er et mål at alle matrikkeladresser skal erstattes av vegadresser. Adressen inneholder informasjon om kretstilhørighet til post-, valg-, tettsted-, sokn- og grunnkrets. Datasettet har ikke med adressens knytning til eiendom (matrikkelnummer) ned på seksjonsnivå, kun til grunneiendom-/feste-nivå. Distribusjonen er satt opp mot en løsning som gir noe forsinkelse fra det offisielle Matrikkelsystemet. Fra ca. 15 minutters forsinkelse på WFS og for nedlasting av fritt valgt område fra kart, en dag forsinkelse for kommunefiler og WMS og ukentlig for fylkes-/landsfiler (ny fil genereres kun hvis det har skjedd endringer i kommunen). Ved større endringer/lastinger kan forsinkelse bli større.
description: Offisielle fysiske adresser registrert i Matrikkelen (Norges offisielle eiendomsregister). En offisiell adresse er den fullstendige adressen for en bygning, bygningsdel, bruksenhet, eiendom eller et annet objekt. En adresse er enten Vegadresse (Storgata 10) eller Matrikkeladresse (33/2-2). Det er et mål at alle matrikkeladresser skal erstattes av vegadresser. Adressen inneholder informasjon om kretstilhørighet til post-, valg-, tettsted-, sokn- og grunnkrets. Datasettet har ikke med adressens knytning til eiendom (matrikkelnummer) ned på seksjonsnivå, kun til grunneiendom-/feste-nivå. Distribusjonen er satt opp mot en løsning som gir noe forsinkelse fra det offisielle Matrikkelsystemet. Fra ca. 15 minutters forsinkelse på WFS og for nedlasting av fritt valgt område fra kart, en dag forsinkelse for kommunefiler og WMS og ukentlig for fylkes-/landsfiler (ny fil genereres kun hvis det har skjedd endringer i kommunen). Ved større endringer/lastinger kan forsinkelse bli større.
status: Sendt inn

Låssettingsplasser
type: Concept
in scheme: FAIR-register
top concept of: FAIR-register
definition: En låssettingsplass er et arealavgrenset område nær strandlinjen hvor fisk oppbevares i not/notinnhengning til den er klar for levering. En låssettingsplass er definert som en plass nær strandlinjen hvor topografiske og hydrografiske forhold er slik at et notsteng kan låssettes der, dvs fisken kan oppbevares i noten/ innhengningen til den er klar for omsetning. En låssettingsplass karakteriseres av at den er godt skjermet for vær og vind, ikke har for mye strøm og har tilstrekkelig dybde, oksygen og saltholdighet.
description: En låssettingsplass er et arealavgrenset område nær strandlinjen hvor fisk oppbevares i not/notinnhengning til den er klar for levering. En låssettingsplass er definert som en plass nær strandlinjen hvor topografiske og hydrografiske forhold er slik at et notsteng kan låssettes der, dvs fisken kan oppbevares i noten/ innhengningen til den er klar for omsetning. En låssettingsplass karakteriseres av at den er godt skjermet for vær og vind, ikke har for mye strøm og har tilstrekkelig dybde, oksygen og saltholdighet.
status: Sendt inn

Dybdedata - terrengmodeller 50 meters grid
type: Concept
in scheme: FAIR-register
top concept of: FAIR-register
definition: Datasettet viser terrengvariasjoner på havbunnen. Terrengmodellene har blitt produsert av innsamlede sjømålingsdata av høy kvalitet. Dekningsområdet kystnært inkluderer store deler av Hordaland og ellers utvalgte områder i Sogn og Fjordane, Møre og Romsdal og Trøndelag. De nordligste fylkene har den beste dekningen med relativt heldekkende dekning nord for 67 grader. For havområdene er dekningen i stor grad avhengig av kartleggingen i forbindelse med MAREANO programmet. MAREANO har kartlagt havområdene utenfor Møre og Romsdal, Trøndelag, Nordland, Troms, Finnmark, Barentshavet øst og ellers utvalgte områder ved Svalbard. Dekningsområdet utvides kontinuerlig etterhvert som nye områder blir kartlagt. Oppløsning på terrengmodellene er 50m x 50m. Terrengmodellene tilbys i UTM sone 33 og geografisk WGS84. Det innebærer at enkelte kartdata ikke ligger i den UTM-sonen som dekker det aktuelle området.
description: Datasettet viser terrengvariasjoner på havbunnen. Terrengmodellene har blitt produsert av innsamlede sjømålingsdata av høy kvalitet. Dekningsområdet kystnært inkluderer store deler av Hordaland og ellers utvalgte områder i Sogn og Fjordane, Møre og Romsdal og Trøndelag. De nordligste fylkene har den beste dekningen med relativt heldekkende dekning nord for 67 grader. For havområdene er dekningen i stor grad avhengig av kartleggingen i forbindelse med MAREANO programmet. MAREANO har kartlagt havområdene utenfor Møre og Romsdal, Trøndelag, Nordland, Troms, Finnmark, Barentshavet øst og ellers utvalgte områder ved Svalbard. Dekningsområdet utvides kontinuerlig etterhvert som nye områder blir kartlagt. Oppløsning på terrengmodellene er 50m x 50m. Terrengmodellene tilbys i UTM sone 33 og geografisk WGS84. Det innebærer at enkelte kartdata ikke ligger i den UTM-sonen som dekker det aktuelle området.
status: Sendt inn

Steinsprang - aktsomhetsområder
type: Concept
in scheme: FAIR-register
top concept of: FAIR-register
definition: Aktsomhetsområder for steinsprang er en nasjonal kartserie som viser potensielt steinsprangutsatte områder på oversiktsnivå. Kartene viser potensielle løsneområder og utløpsområder for steinsprang. Det gjøres oppmerksom på at arealene som dekkes av utløsningsområder i praksis også er utløpsområder, ettersom skred som løsner helt øverst i et utløsningsområde beveger seg gjennom nedenforliggende utløsningsområder før det når utløpsområdene nedenfor. Ved bruk av datasettet til analyseformål bør derfor som en hovedregel både utløsningsområder og utløpsområder benyttes sammen. Aktsomhetsområdene er identifisert ved bruk av en datamodell som gjenkjenner mulige løsneområder for steinsprang ut fra helning på terreng og geologisk informasjon. Fra hvert kildeområde er utløpsområdet for steinsprang beregnet automatisk. Det er ikke gjort feltarbeid ved identifisering eller avgrensning av områdene.
description: Aktsomhetsområder for steinsprang er en nasjonal kartserie som viser potensielt steinsprangutsatte områder på oversiktsnivå. Kartene viser potensielle løsneområder og utløpsområder for steinsprang. Det gjøres oppmerksom på at arealene som dekkes av utløsningsområder i praksis også er utløpsområder, ettersom skred som løsner helt øverst i et utløsningsområde beveger seg gjennom nedenforliggende utløsningsområder før det når utløpsområdene nedenfor. Ved bruk av datasettet til analyseformål bør derfor som en hovedregel både utløsningsområder og utløpsområder benyttes sammen. Aktsomhetsområdene er identifisert ved bruk av en datamodell som gjenkjenner mulige løsneområder for steinsprang ut fra helning på terreng og geologisk informasjon. Fra hvert kildeområde er utløpsområdet for steinsprang beregnet automatisk. Det er ikke gjort feltarbeid ved identifisering eller avgrensning av områdene.
status: Sendt inn

FKB-AR5
type: Concept
in scheme: FAIR-register
top concept of: FAIR-register
definition: FKB-AR5, som står for "Felles Kartdatabase - Arealressurs 5", representerer en omfattende kartlegging og beskrivelse av Norges arealressurser på et svært detaljert nivå. Dette datasettet er designet for å gi en grundig og presis oversikt over landets arealbruk, naturressurser, og topografiske forhold, og er et kritisk verktøy for planleggere, forskere, og beslutningstakere som arbeider med landforvaltning, miljøovervåking, og utviklingsplanlegging. AR5-datasettet er flatedekkende, noe som betyr at det gir en sammenhengende oversikt over hele Norges landareal, inkludert både urbane og rurale områder. Det skiller seg ut ved sin høye oppløsning og detaljnivå, som muliggjør analyse og kartframstillinger av høy kvalitet. Denne detaljerte innsikten er spesielt verdifull for å forstå og håndtere komplekse arealbruksutfordringer, som balansen mellom bevaring og utvikling, landbruk, skogbruk, og byutvikling. En av de viktigste funksjonene til AR5 er dens rolle i ajourhold og oppdatering av Norges arealressursinformasjon. Ved å tilby en detaljert og nøyaktig base, gjør AR5 det mulig for ulike aktører å hollegge, oppdatere, og dele relevant informasjon om arealbruksendringer, miljøtilstand, og ressursforvaltning. Dette sikrer at beslutningstaking kan baseres på oppdatert og nøyaktig informasjon, noe som er avgjørende for effektiv forvaltning og bærekraftig utvikling. Videre er AR5 designet for å være fleksibelt og tilgjengelig for en bred brukergruppe, inkludert offentlige etater, private selskaper, forskningsinstitusjoner, og den generelle offentligheten. Dette gjør datasettet til et verdifullt verktøy for en rekke analyseformål, fra miljøovervåking og risikostyring til urban planlegging og landskapsanalyser. Samlet sett representerer FKB-AR5 et fundamentalt verktøy for å forstå, forvalte, og utvikle Norges arealressurser på en bærekraftig måte. Dets detaljerte innsikt og omfattende dekning gjør det mulig for brukere å utføre avanserte analyser og skape informative kartframst…
description: FKB-AR5, som står for "Felles Kartdatabase - Arealressurs 5", representerer en omfattende kartlegging og beskrivelse av Norges arealressurser på et svært detaljert nivå. Dette datasettet er designet for å gi en grundig og presis oversikt over landets arealbruk, naturressurser, og topografiske forhold, og er et kritisk verktøy for planleggere, forskere, og beslutningstakere som arbeider med landforvaltning, miljøovervåking, og utviklingsplanlegging. AR5-datasettet er flatedekkende, noe som betyr at det gir en sammenhengende oversikt over hele Norges landareal, inkludert både urbane og rurale områder. Det skiller seg ut ved sin høye oppløsning og detaljnivå, som muliggjør analyse og kartframstillinger av høy kvalitet. Denne detaljerte innsikten er spesielt verdifull for å forstå og håndtere komplekse arealbruksutfordringer, som balansen mellom bevaring og utvikling, landbruk, skogbruk, og byutvikling. En av de viktigste funksjonene til AR5 er dens rolle i ajourhold og oppdatering av Norges arealressursinformasjon. Ved å tilby en detaljert og nøyaktig base, gjør AR5 det mulig for ulike aktører å hollegge, oppdatere, og dele relevant informasjon om arealbruksendringer, miljøtilstand, og ressursforvaltning. Dette sikrer at beslutningstaking kan baseres på oppdatert og nøyaktig informasjon, noe som er avgjørende for effektiv forvaltning og bærekraftig utvikling. Videre er AR5 designet for å være fleksibelt og tilgjengelig for en bred brukergruppe, inkludert offentlige etater, private selskaper, forskningsinstitusjoner, og den generelle offentligheten. Dette gjør datasettet til et verdifullt verktøy for en rekke analyseformål, fra miljøovervåking og risikostyring til urban planlegging og landskapsanalyser. Samlet sett representerer FKB-AR5 et fundamentalt verktøy for å forstå, forvalte, og utvikle Norges arealressurser på en bærekraftig måte. Dets detaljerte innsikt og omfattende dekning gjør det mulig for brukere å utføre avanserte analyser og skape informative kartframst…
status: Sendt inn

FKB-TraktorvegSti
type: Concept
in scheme: FAIR-register
top concept of: FAIR-register
definition: FKB-TraktorvegSti er en del av Felles Kartdatabase (FKB). FKB er en samling datasett som utgjør en sentral del av grunnkartet. Se metadataoppføring for Felles Kartdatabase for mer info. FKB-TraktorvegSti er et landsdekkende FKB-datasett som inneholder traktorveger, stier og stitrapp med senterlinjegeometri. FKB-TraktorvegSti må sees i sammenheng med Elveg 2.0 som inneholder øvrig vegnett og som forvaltes i Nasjonal vegdatabank (NVDB). Sammen med vegnettet fra NVDB skal FKB-TraktorvegSti kunne danne et komplett samferdselsnettverk for kjørende, syklende og gående. Datagrunnlaget i FKB-TraktorvegSti vil ha svært varierende grad av nettverkstopologi. Man må regne med å gjøre en jobb med sammenknytning av FKB-TraktorvegSti og Elveg 2.0 før dette kan betraktes som ett nettverk og benyttes i nettverksanalyser. FKB-data er ikke-sensistive og åpne data. FKB-dataene er finansiert gjennom Geovekst-samarbeidet, eller kommunene alene for kommuner som står utenfor Geovekst. FKB-dataene er fritt tilgjengelige for Norge digitalt parter og kan lastes ned gjennom nedlastingsløsningen på Geonorge. Private aktører må kjøpe tilgang til dataene gjennom en forhandler.
description: FKB-TraktorvegSti er en del av Felles Kartdatabase (FKB). FKB er en samling datasett som utgjør en sentral del av grunnkartet. Se metadataoppføring for Felles Kartdatabase for mer info. FKB-TraktorvegSti er et landsdekkende FKB-datasett som inneholder traktorveger, stier og stitrapp med senterlinjegeometri. FKB-TraktorvegSti må sees i sammenheng med Elveg 2.0 som inneholder øvrig vegnett og som forvaltes i Nasjonal vegdatabank (NVDB). Sammen med vegnettet fra NVDB skal FKB-TraktorvegSti kunne danne et komplett samferdselsnettverk for kjørende, syklende og gående. Datagrunnlaget i FKB-TraktorvegSti vil ha svært varierende grad av nettverkstopologi. Man må regne med å gjøre en jobb med sammenknytning av FKB-TraktorvegSti og Elveg 2.0 før dette kan betraktes som ett nettverk og benyttes i nettverksanalyser. FKB-data er ikke-sensistive og åpne data. FKB-dataene er finansiert gjennom Geovekst-samarbeidet, eller kommunene alene for kommuner som står utenfor Geovekst. FKB-dataene er fritt tilgjengelige for Norge digitalt parter og kan lastes ned gjennom nedlastingsløsningen på Geonorge. Private aktører må kjøpe tilgang til dataene gjennom en forhandler.
status: Sendt inn

Naturtyper - Elvedelta
type: Concept
in scheme: FAIR-register
top concept of: FAIR-register
definition: Datasettet omfatter de fleste elvedelta større enn 250 daa i Norge. Svalbard er ikke inkludert. Utgangspunktet er Elvedeltabasen, som ble etablert av Direktoratet for naturforvaltning i 1999, og som har vært publisert på nettstedet elvedelta.no. Etablering som geografisk datasett erstatter denne publiseringen. Bakgrunnen for datasettet er at elvedelta er en naturtype som kan ha store biologiske verdier, samtidig som naturtypen er svært utsatt for naturinngrep og påvirkninger i form av forurensning, kraftutbygging, utfylling o.l. I forbindelse med etablering av Elvedeltabasen ble det i samarbeid med NVE og NGU utviklet metodikk/kriterier for avgrensing av deltaområdet, inndeling i deltatyper og vurdering av grad av menneskelig påvirkning. Dokumenter som beskriver metodikk/kriterier er tilgjengelig under dokumentasjonen av datasettet i Miljødirektoratets kartkatalog.
description: Datasettet omfatter de fleste elvedelta større enn 250 daa i Norge. Svalbard er ikke inkludert. Utgangspunktet er Elvedeltabasen, som ble etablert av Direktoratet for naturforvaltning i 1999, og som har vært publisert på nettstedet elvedelta.no. Etablering som geografisk datasett erstatter denne publiseringen. Bakgrunnen for datasettet er at elvedelta er en naturtype som kan ha store biologiske verdier, samtidig som naturtypen er svært utsatt for naturinngrep og påvirkninger i form av forurensning, kraftutbygging, utfylling o.l. I forbindelse med etablering av Elvedeltabasen ble det i samarbeid med NVE og NGU utviklet metodikk/kriterier for avgrensing av deltaområdet, inndeling i deltatyper og vurdering av grad av menneskelig påvirkning. Dokumenter som beskriver metodikk/kriterier er tilgjengelig under dokumentasjonen av datasettet i Miljødirektoratets kartkatalog.
status: Sendt inn

Kulturminner - Kulturmiljøer
type: Concept
in scheme: FAIR-register
top concept of: FAIR-register
definition: Datasettet "Kulturminner – kulturmiljøer" dekker freda kulturmiljøer, Kulturmiljø og landskap av lokal interesse, Kulturmiljøer og landskap av nasjonal interesse, Kulturmiljø og landskap av regional interesse og verdensarvområder. For beskrivelser og definisjoner av de ulike kategoriene kulturmilijøer, se https://register.geonorge.no/sosi-kodelister/kulturminner/kulturmilj%C3%B8kategori
description: Datasettet "Kulturminner – kulturmiljøer" dekker freda kulturmiljøer, Kulturmiljø og landskap av lokal interesse, Kulturmiljøer og landskap av nasjonal interesse, Kulturmiljø og landskap av regional interesse og verdensarvområder. For beskrivelser og definisjoner av de ulike kategoriene kulturmilijøer, se https://register.geonorge.no/sosi-kodelister/kulturminner/kulturmilj%C3%B8kategori
status: Sendt inn

Mineralressurser: industrimineral, naturstein og metaller
type: Concept
in scheme: FAIR-register
top concept of: FAIR-register
definition: Dataene gir en oversikt over registrerte oppføringer av industrimineral, naturstein og metallressurser. Mineralressursdataene inneholder både areal- og punktoppføringer for alle tre grupper. Datasettet gir en oversikt over dokumenterte forekomster (verdivurderte arealer; forekomst/deposit), prospektive områder (arealer med høy sannsynlighet for funn av økonomisk interessante mineraler; prospekt/prospect), registreringer hvor det er observert og/eller analysert forhøyede verdier av økonomisk interessante mineraler (registrering/occurence) og provinser (arealer med muligheter for funn av gitte mineraler; provins/province). Registreringene kan inneholde lite eller mye informasjon. De dokumenterte forekomstene inneholder en vurdering av offentlig betydning; internasjonal, nasjonal, regional, lokal, liten eller ingen eller ikke vurdert. Dataene er innsamlet over lang tid og oppdateres fortløpende etter prioriteringer.
description: Dataene gir en oversikt over registrerte oppføringer av industrimineral, naturstein og metallressurser. Mineralressursdataene inneholder både areal- og punktoppføringer for alle tre grupper. Datasettet gir en oversikt over dokumenterte forekomster (verdivurderte arealer; forekomst/deposit), prospektive områder (arealer med høy sannsynlighet for funn av økonomisk interessante mineraler; prospekt/prospect), registreringer hvor det er observert og/eller analysert forhøyede verdier av økonomisk interessante mineraler (registrering/occurence) og provinser (arealer med muligheter for funn av gitte mineraler; provins/province). Registreringene kan inneholde lite eller mye informasjon. De dokumenterte forekomstene inneholder en vurdering av offentlig betydning; internasjonal, nasjonal, regional, lokal, liten eller ingen eller ikke vurdert. Dataene er innsamlet over lang tid og oppdateres fortløpende etter prioriteringer.
status: Sendt inn

Friluftslivsområder - vernede
type: Concept
in scheme: FAIR-register
top concept of: FAIR-register
definition: Datasettet viser friluftslivsområder som er vernet etter Lov om naturområder i Oslo og nærliggende kommuner (markaloven) § 11. Formålet med vernet er generelt å bevare naturopplevelsesverdier som gjør områdene særskilt verdifulle for friluftslivet. En forskrift for hvert område beskriver nærmere formål, avgrensning, vernebestemmelser mv. Vernede friluftslivsområder ligger i Oslo og Nordre Follo kommuner.
description: Datasettet viser friluftslivsområder som er vernet etter Lov om naturområder i Oslo og nærliggende kommuner (markaloven) § 11. Formålet med vernet er generelt å bevare naturopplevelsesverdier som gjør områdene særskilt verdifulle for friluftslivet. En forskrift for hvert område beskriver nærmere formål, avgrensning, vernebestemmelser mv. Vernede friluftslivsområder ligger i Oslo og Nordre Follo kommuner.
status: Sendt inn

Matrikkelen - Bygningspunkt
type: Concept
in scheme: FAIR-register
top concept of: FAIR-register
definition: Datasettet Matrikkelen-Bygningspunkt inneholder et lite utdrag av bygningsinformasjonen som er registrert i Matrikkelen, Norges offisielle register over fast eiendom, herunder bygninger.\\nDatasettet inneholder representasjonspunkt, bygningstype, bygningsnummer, nåværende bygningsstatus. I tillegg inneholder det ulike id-er for gjenfinning og koblinger (lokal id eller universell uuid) for bygning, og det leveres id(er) for adresse og eiendom pr bygning (hentet fra bruksenhetobjekter i matrikkelsystemet) samt Sefrak-id. \\n\\nUtgåtte bygninger er ikke med, - heller ikke bygningsendringer som for eksempel påbygg eller tilbygg.\\nProduktet inneholder data som er fritt tilgjengelig for alle.\\n\\nDistribusjoner er satt opp mot en distribusjonsløsning som baserer seg på endringslogg-tjeneste fra Matrikkelsystemet. De ulike distribusjonene har ulik oppdateringsfrekvens, fra 15 minutters forsinkelse på WFS og nedlasting av fritt valgt område fra kart, daglig for kommunevise filer og ukentlig for fylkes- og lands-filer (ny fil kun hvis det er skjedd endringer i Matrikkelen). Ved større endringer/lastinger kan forsinkelsen bli større.
description: Datasettet Matrikkelen-Bygningspunkt inneholder et lite utdrag av bygningsinformasjonen som er registrert i Matrikkelen, Norges offisielle register over fast eiendom, herunder bygninger.\\nDatasettet inneholder representasjonspunkt, bygningstype, bygningsnummer, nåværende bygningsstatus. I tillegg inneholder det ulike id-er for gjenfinning og koblinger (lokal id eller universell uuid) for bygning, og det leveres id(er) for adresse og eiendom pr bygning (hentet fra bruksenhetobjekter i matrikkelsystemet) samt Sefrak-id. \\n\\nUtgåtte bygninger er ikke med, - heller ikke bygningsendringer som for eksempel påbygg eller tilbygg.\\nProduktet inneholder data som er fritt tilgjengelig for alle.\\n\\nDistribusjoner er satt opp mot en distribusjonsløsning som baserer seg på endringslogg-tjeneste fra Matrikkelsystemet. De ulike distribusjonene har ulik oppdateringsfrekvens, fra 15 minutters forsinkelse på WFS og nedlasting av fritt valgt område fra kart, daglig for kommunevise filer og ukentlig for fylkes- og lands-filer (ny fil kun hvis det er skjedd endringer i Matrikkelen). Ved større endringer/lastinger kan forsinkelsen bli større.
status: Sendt inn

N5 Raster
type: Concept
in scheme: FAIR-register
top concept of: FAIR-register
definition: Informasjon lik kartene i Økonomisk kartverk. Symboler, linjer og tekst med samme form som på kartene. Informasjonen forefinnes som et rasterlag pr. kartblad. Datamengde ca. 1 Mb pr. kartblad i TIFF-format.
description: Informasjon lik kartene i Økonomisk kartverk. Symboler, linjer og tekst med samme form som på kartene. Informasjonen forefinnes som et rasterlag pr. kartblad. Datamengde ca. 1 Mb pr. kartblad i TIFF-format.
status: Sendt inn

Marin grense
type: Concept
in scheme: FAIR-register
top concept of: FAIR-register
definition: Marin grense angir det høyeste nivået som havet nådde etter siste istid. Informasjon om marin grense er sentral i arbeidet med å avgrense områder med marine leirer i Norge. Marin grense angir høyeste nivået for marint avsatte sedimenter på land. Problemstillinger som involverer slike avsetninger kan utelukkes over marin grense, hvilket er viktig informasjon i bl.a. offentlig planarbeid. For eksempel kan kvikkleire og skred i hav- og fjordavsetninger som marin leire kun forekomme under marin grense. Videre kan grunnvannskvaliteten under marin grense være påvirket av relikt saltvann, og leire kan begrense utbredelsen av akviferer. Informasjon vedrørende tidligere havnivå er også av betydning for forståelsen av landskapsutvikling generelt. Dataene består av punktregistreringer, linjer samt polygoner. Linjer og polygoner er modellert fra punktene og en 10 m terrengmodell. Terrengmodellen som er benyttet i analysen har oppløsning (rutenettstørrelse) på 10x10 meter, og er hentet fra hoydedata.no. Terrengmodellen er generert ut fra de detaljerte laserdata som var tilgjengelig høsten 2020, supplert med høydedata fra 2013-utgaven av DTM10 for områder uten dekning. Datasettet er landsdekkende.
description: Marin grense angir det høyeste nivået som havet nådde etter siste istid. Informasjon om marin grense er sentral i arbeidet med å avgrense områder med marine leirer i Norge. Marin grense angir høyeste nivået for marint avsatte sedimenter på land. Problemstillinger som involverer slike avsetninger kan utelukkes over marin grense, hvilket er viktig informasjon i bl.a. offentlig planarbeid. For eksempel kan kvikkleire og skred i hav- og fjordavsetninger som marin leire kun forekomme under marin grense. Videre kan grunnvannskvaliteten under marin grense være påvirket av relikt saltvann, og leire kan begrense utbredelsen av akviferer. Informasjon vedrørende tidligere havnivå er også av betydning for forståelsen av landskapsutvikling generelt. Dataene består av punktregistreringer, linjer samt polygoner. Linjer og polygoner er modellert fra punktene og en 10 m terrengmodell. Terrengmodellen som er benyttet i analysen har oppløsning (rutenettstørrelse) på 10x10 meter, og er hentet fra hoydedata.no. Terrengmodellen er generert ut fra de detaljerte laserdata som var tilgjengelig høsten 2020, supplert med høydedata fra 2013-utgaven av DTM10 for områder uten dekning. Datasettet er landsdekkende.
status: Sendt inn

Marine naturtyper (HB19)
type: Concept
in scheme: FAIR-register
top concept of: FAIR-register
definition: Datasettet er tidligere publisert under navnet "Naturtyper - DN-håndbok 19". Datasettet viser naturtypelokaliteter som kartlagt etter DN-håndbok 19 Kartlegging av marint biologisk mangfold og som er publisert av Miljødirektoratet. Kartleggingsinstruksen er basert på DN-håndbok 19, revidert i 2007, da feltkartleggingen startet for fullt. Den enkelte lokalitet er registrert med en naturtype, som kan være registrert mer detaljert som utforming. Naturtyper prioritert for kartlegging er beskrevet i DN-håndbok 19. Hver registrert lokalitet er gitt en naturfaglig verdi, basert på størrelse, tilstand og naturmangfold. Lokalitetene har en områdebeskrivelse med vekt på å forklare verdisettingen. Den geografiske presisjonen er jevnt over god for hele datasettet. Forbedring av modeller for prediksjon av naturtyper har også gitt noe bedre presisjon over tid. I datasettet inngår også nøkkellokaliteter for noen arter av skjell, som av praktiske årsaker er etablert som naturtypedata. Kartleggingsprogrammet er gjennomført i samarbeid med Fiskeridirektoratet.
description: Datasettet er tidligere publisert under navnet "Naturtyper - DN-håndbok 19". Datasettet viser naturtypelokaliteter som kartlagt etter DN-håndbok 19 Kartlegging av marint biologisk mangfold og som er publisert av Miljødirektoratet. Kartleggingsinstruksen er basert på DN-håndbok 19, revidert i 2007, da feltkartleggingen startet for fullt. Den enkelte lokalitet er registrert med en naturtype, som kan være registrert mer detaljert som utforming. Naturtyper prioritert for kartlegging er beskrevet i DN-håndbok 19. Hver registrert lokalitet er gitt en naturfaglig verdi, basert på størrelse, tilstand og naturmangfold. Lokalitetene har en områdebeskrivelse med vekt på å forklare verdisettingen. Den geografiske presisjonen er jevnt over god for hele datasettet. Forbedring av modeller for prediksjon av naturtyper har også gitt noe bedre presisjon over tid. I datasettet inngår også nøkkellokaliteter for noen arter av skjell, som av praktiske årsaker er etablert som naturtypedata. Kartleggingsprogrammet er gjennomført i samarbeid med Fiskeridirektoratet.
status: Sendt inn

Dyrkbar jord
type: Concept
in scheme: FAIR-register
top concept of: FAIR-register
definition: Dyrkbar jord er i år (2025) revidert gjennom bruk av flere datakilder og nye metoder, og det nye datsettet ble gjort tilgjengelig via Geonorge den 16. september. Det er nå lagt inn flere nye tematiske egenskaper i datasettet, og det er gjort en teknisk rydding som innebærer nye objekter og ny geometri. Gå til produktsiden for å lese mer om det reviderte datasettet. Datasettet Dyrkbar jord er et landsdekkende data-sett som viser arealer som per i dag ikke er fulldyrka jord, men som ut fra agronomiske perspektiv kan dyrkes opp, og som holder kravene til klima og jordkvalitet for plantedyrking. Dyrkbar jord kan være registrert på arealtypene Overflatedyrka jord, Innmarksbeite, Skog, Åpen fastmark og Myr, slik disse er klassifisert i AR5. Datasettet er et automatisk avledet produkt som produseres årlig.
description: Dyrkbar jord er i år (2025) revidert gjennom bruk av flere datakilder og nye metoder, og det nye datsettet ble gjort tilgjengelig via Geonorge den 16. september. Det er nå lagt inn flere nye tematiske egenskaper i datasettet, og det er gjort en teknisk rydding som innebærer nye objekter og ny geometri. Gå til produktsiden for å lese mer om det reviderte datasettet. Datasettet Dyrkbar jord er et landsdekkende data-sett som viser arealer som per i dag ikke er fulldyrka jord, men som ut fra agronomiske perspektiv kan dyrkes opp, og som holder kravene til klima og jordkvalitet for plantedyrking. Dyrkbar jord kan være registrert på arealtypene Overflatedyrka jord, Innmarksbeite, Skog, Åpen fastmark og Myr, slik disse er klassifisert i AR5. Datasettet er et automatisk avledet produkt som produseres årlig.
status: Sendt inn

Bergrettigheter
type: Concept
in scheme: FAIR-register
top concept of: FAIR-register
definition: Dataene viser områder som er belagt med bergrettigheter for statens mineraler, som definert av "Lov om erverv og utvinning av mineralressurser (mineralloven)" §7. Datasettet inneholder definerte områder for undersøkelses (UN)- og utvinningsretter (UT). Det kan være utstedt flere bergrettigheter for samme geografiske område; datasettet har overlappende flater, men de individuelle rettighetene har forskjellig prioritet. Første prioritet gjelder basert på mottatt dato, beskrevet i attributtet InnsendtDato. Direktoratet for mineralforvaltning med Bergmesteren for Svalbard (DMF) er eier av datasettet. En undersøkelsesrett på statens mineraler tildeles som en rett på et bestemt område, og ikke som en rettighet til en bestemt forekomst. Den som har undersøkelsesrett med best prioritet, dvs. den som søkte om retten først, har enerett til å søke om utvinningsrett etter minerallovens § 29. Gyldighet for undersøkelsesretter er 7 år fra best prioritet, utvinningsrettigheter har 10 års gyldighet. Rettigheter kan forlenges ved vedtak, jf. mineralloven § 23 og §§ 33 - 34.
description: Dataene viser områder som er belagt med bergrettigheter for statens mineraler, som definert av "Lov om erverv og utvinning av mineralressurser (mineralloven)" §7. Datasettet inneholder definerte områder for undersøkelses (UN)- og utvinningsretter (UT). Det kan være utstedt flere bergrettigheter for samme geografiske område; datasettet har overlappende flater, men de individuelle rettighetene har forskjellig prioritet. Første prioritet gjelder basert på mottatt dato, beskrevet i attributtet InnsendtDato. Direktoratet for mineralforvaltning med Bergmesteren for Svalbard (DMF) er eier av datasettet. En undersøkelsesrett på statens mineraler tildeles som en rett på et bestemt område, og ikke som en rettighet til en bestemt forekomst. Den som har undersøkelsesrett med best prioritet, dvs. den som søkte om retten først, har enerett til å søke om utvinningsrett etter minerallovens § 29. Gyldighet for undersøkelsesretter er 7 år fra best prioritet, utvinningsrettigheter har 10 års gyldighet. Rettigheter kan forlenges ved vedtak, jf. mineralloven § 23 og §§ 33 - 34.
status: Sendt inn

Lufthavn - Byggerestriksjoner (BRA)
type: Concept
in scheme: FAIR-register
top concept of: FAIR-register
definition: BRA står for Building Restriction Areas, og beskriver et eller flere områder rundt flyplasser og enkeltstående NAV-anlegg der bygg og konstruksjoner kan forårsake forstyrrelser på signalene mellom fly og bakke, og som vil kunne medføre nærmere bestemte restriksjoner.
description: BRA står for Building Restriction Areas, og beskriver et eller flere områder rundt flyplasser og enkeltstående NAV-anlegg der bygg og konstruksjoner kan forårsake forstyrrelser på signalene mellom fly og bakke, og som vil kunne medføre nærmere bestemte restriksjoner.
status: Sendt inn

Villreinområder
type: Concept
in scheme: FAIR-register
top concept of: FAIR-register
definition: Datasettet inneholder data fra nasjonale villreinområder. På Norges fastland finnes 24 villreinområder, hvorav ti er utpekt som nasjonale. Disse er Forollhogna, Hardangervidda, Knutshø, Nordfjella, Reinheimen-Breheimen, Rondane, Setesdal-Austhei, Setesdal-Ryfylke, Snøhetta og Sølnkletten. \\n\\nDatasettet viser yttergrenser for villreinbestandenes biologiske leveområde. I tillegg vises funksjonsområder der dette er kartlagt. Funksjonsområdene i datasettet er trekkvei og trekkområde, beiteområde, kalvingsområde og brunstområde. Den største polygonen for hvert villreinområde viser yttergrensen for leveområdet. De mindre polygonene innenfor leveområdet er funksjonsområder. \\n\\nAdministrative grenser er ikke inkludert i datasettet.
description: Datasettet inneholder data fra nasjonale villreinområder. På Norges fastland finnes 24 villreinområder, hvorav ti er utpekt som nasjonale. Disse er Forollhogna, Hardangervidda, Knutshø, Nordfjella, Reinheimen-Breheimen, Rondane, Setesdal-Austhei, Setesdal-Ryfylke, Snøhetta og Sølnkletten. \\n\\nDatasettet viser yttergrenser for villreinbestandenes biologiske leveområde. I tillegg vises funksjonsområder der dette er kartlagt. Funksjonsområdene i datasettet er trekkvei og trekkområde, beiteområde, kalvingsområde og brunstområde. Den største polygonen for hvert villreinområde viser yttergrensen for leveområdet. De mindre polygonene innenfor leveområdet er funksjonsområder. \\n\\nAdministrative grenser er ikke inkludert i datasettet.
status: Sendt inn

Jernbane - Banenettverk
type: Concept
in scheme: FAIR-register
top concept of: FAIR-register
definition: Datasettet Banenettverk inneheld referanselinjer for jernbanestrekningar som er ein del av statens jernbaneinfrastruktur (samt museumsbanar) i Norge med geografisk stedfesta linjegeometri og noder i eit topologisk nettverk. Nettverket har verdiar i samsvar med Bane NOR sin modell for lineære referansar (kilometrering).
description: Datasettet Banenettverk inneheld referanselinjer for jernbanestrekningar som er ein del av statens jernbaneinfrastruktur (samt museumsbanar) i Norge med geografisk stedfesta linjegeometri og noder i eit topologisk nettverk. Nettverket har verdiar i samsvar med Bane NOR sin modell for lineære referansar (kilometrering).
status: Sendt inn

Aktsomhetskart for jord- og flomskred
type: Concept
in scheme: FAIR-register
top concept of: FAIR-register
definition: NVEs aktsomhetskart for jord- og flomskred viser potensielle utløpsområder for ulike typer løsmasseskred. Det omfatter ikke kvikkleireskred og grunne utglidninger i lave løsmasseskråninger, og ikke masseførende flom. Aktsomhetskartet er basert på deldatasettene «jord- og flomskred» (2025) og «mellomstore flomskred» (2014). Ved bruk av datasettet til analyseformål bør som hovedregel hele utløpsområdet vurderes. Utløpsområdet dekker alle areal hvor skredet fortsatt inneholder en viss andel fast materiale som kan avsettes.Dersom vanninnholdet i skredet er veldig høyt, kan den mest flytende delen av skredet i visse tilfeller nå enda lenger.
description: NVEs aktsomhetskart for jord- og flomskred viser potensielle utløpsområder for ulike typer løsmasseskred. Det omfatter ikke kvikkleireskred og grunne utglidninger i lave løsmasseskråninger, og ikke masseførende flom. Aktsomhetskartet er basert på deldatasettene «jord- og flomskred» (2025) og «mellomstore flomskred» (2014). Ved bruk av datasettet til analyseformål bør som hovedregel hele utløpsområdet vurderes. Utløpsområdet dekker alle areal hvor skredet fortsatt inneholder en viss andel fast materiale som kan avsettes.Dersom vanninnholdet i skredet er veldig høyt, kan den mest flytende delen av skredet i visse tilfeller nå enda lenger.
status: Sendt inn

Naturtyper - utvalgte
type: Concept
in scheme: FAIR-register
top concept of: FAIR-register
definition: Datasettet viser registrerte forekomster av utvalgte naturtyper, jf forskrift om utvalgte naturtyper, http://lovdata.no/dokument/SF/forskrift/2011-05-13-512. Åtte naturtyper har status som utvalgt naturtype: Kystlynghei, slåttemark, slåttemyr, kalklindeskog, kalksjøer, hule eiker, åpen grunnlendt kalkmark i boreonemoral sone og olivinskog. Lokaliteter av utvalgte naturtyper forvaltes i Miljødirektoratets datasett Naturtyper - DN-håndbok 13 og Naturtyper – Miljødirektoratets instruks. Forskriften for utvalgte naturtyper gjelder alle lokaliteter som fyller kravene i forskriften, uavhengig av om lokaliteten er registrert i Naturbase eller ikke. Statsforvalteren vil kunne bistå dersom det er usikkerhet om hvorvidt en lokalitet faktisk er en utvalgt naturtype. I tvilstilfeller kan det være nødvendig å kontakte spesialkompetanse for å få gjort en vurdering.
description: Datasettet viser registrerte forekomster av utvalgte naturtyper, jf forskrift om utvalgte naturtyper, http://lovdata.no/dokument/SF/forskrift/2011-05-13-512. Åtte naturtyper har status som utvalgt naturtype: Kystlynghei, slåttemark, slåttemyr, kalklindeskog, kalksjøer, hule eiker, åpen grunnlendt kalkmark i boreonemoral sone og olivinskog. Lokaliteter av utvalgte naturtyper forvaltes i Miljødirektoratets datasett Naturtyper - DN-håndbok 13 og Naturtyper – Miljødirektoratets instruks. Forskriften for utvalgte naturtyper gjelder alle lokaliteter som fyller kravene i forskriften, uavhengig av om lokaliteten er registrert i Naturbase eller ikke. Statsforvalteren vil kunne bistå dersom det er usikkerhet om hvorvidt en lokalitet faktisk er en utvalgt naturtype. I tvilstilfeller kan det være nødvendig å kontakte spesialkompetanse for å få gjort en vurdering.
status: Sendt inn

Reindrift - Reindriftsanlegg
type: Concept
in scheme: FAIR-register
top concept of: FAIR-register
definition: Datasettet reindriftsanlegg gir opplysninger om ulike typer gjerder, gjeterhytter og anlegg som er tilknyttet reindrifta. Retten til å utøve reindrift kan også gi rett til husvære, buer o.l. etter reindriftsloven § 21, og rett til å føre opp arbeids- og sperregjerder, slakteanlegg, broer og andre anlegg som er nødvendige for reindriften, etter reindriftsloven § 24. Gjerder og anlegg som skal bli stående ut over en sesong, kan ikke oppføres uten godkjenning av departementet. Datasettet gir illustrasjon på stedfesting av ulike typer gjerder og anlegg i tilknyttet reindrifta. Dette kan være både linjer og punkter.
description: Datasettet reindriftsanlegg gir opplysninger om ulike typer gjerder, gjeterhytter og anlegg som er tilknyttet reindrifta. Retten til å utøve reindrift kan også gi rett til husvære, buer o.l. etter reindriftsloven § 21, og rett til å føre opp arbeids- og sperregjerder, slakteanlegg, broer og andre anlegg som er nødvendige for reindriften, etter reindriftsloven § 24. Gjerder og anlegg som skal bli stående ut over en sesong, kan ikke oppføres uten godkjenning av departementet. Datasettet gir illustrasjon på stedfesting av ulike typer gjerder og anlegg i tilknyttet reindrifta. Dette kan være både linjer og punkter.
status: Sendt inn

Digitale ortofoto
type: Concept
in scheme: FAIR-register
top concept of: FAIR-register
definition: Ortofoto er flybilder med de samme geometriske egenskaper som et kart og kan knyttes til et referansesystem. Ortofotoene dekker hele landet med varierende oppløsning og nøyaktighet. Bilder over by- og utbyggingsområder har som regel best oppløsning og nøyaktighet. Bildeprosjektene varierer i utstrekning, fra små prosjekter i en kommune, til store prosjekter som kan dekke hele regioner.
description: Ortofoto er flybilder med de samme geometriske egenskaper som et kart og kan knyttes til et referansesystem. Ortofotoene dekker hele landet med varierende oppløsning og nøyaktighet. Bilder over by- og utbyggingsområder har som regel best oppløsning og nøyaktighet. Bildeprosjektene varierer i utstrekning, fra små prosjekter i en kommune, til store prosjekter som kan dekke hele regioner.
status: Sendt inn

FKB-Ledning
type: Concept
in scheme: FAIR-register
top concept of: FAIR-register
definition: FKB-Ledning er en del av Felles Kartdatabase (FKB). FKB er en samling datasett som utgjør en sentral del av grunnkartet. Se metadataoppføring for Felles Kartdatabase for mer info. FKB-Ledning omfatter ledningsdata innenfor elektrisitet, elektrisk kommunikasjon, belysningsanlegg, ledningsanlegg tilknyttet bane og VA. Det er kun objekter som er synlig i terrenget (ligger på eller over bakkenivå) som inngår i produktspesifikasjonen. Produktspesifikasjonen er tenkt benyttet ved datafangst av ledningsobjekter og som et grunnlag for distribusjon av FKB-data. FKB-data er ikke-sensistive og åpne data. FKB-dataene er finansiert gjennom Geovekst-samarbeidet, eller kommunene alene for kommuner som står utenfor Geovekst. FKB-dataene er fritt tilgjengelige for Norge digitalt parter og kan lastes ned gjennom nedlastingsløsningen på Geonorge. Private aktører må kjøpe tilgang til dataene gjennom en forhandler.
description: FKB-Ledning er en del av Felles Kartdatabase (FKB). FKB er en samling datasett som utgjør en sentral del av grunnkartet. Se metadataoppføring for Felles Kartdatabase for mer info. FKB-Ledning omfatter ledningsdata innenfor elektrisitet, elektrisk kommunikasjon, belysningsanlegg, ledningsanlegg tilknyttet bane og VA. Det er kun objekter som er synlig i terrenget (ligger på eller over bakkenivå) som inngår i produktspesifikasjonen. Produktspesifikasjonen er tenkt benyttet ved datafangst av ledningsobjekter og som et grunnlag for distribusjon av FKB-data. FKB-data er ikke-sensistive og åpne data. FKB-dataene er finansiert gjennom Geovekst-samarbeidet, eller kommunene alene for kommuner som står utenfor Geovekst. FKB-dataene er fritt tilgjengelige for Norge digitalt parter og kan lastes ned gjennom nedlastingsløsningen på Geonorge. Private aktører må kjøpe tilgang til dataene gjennom en forhandler.
status: Sendt inn

Reindrift - Konsesjonsområde
type: Concept
in scheme: FAIR-register
top concept of: FAIR-register
definition: Datasettet konsesjonsområde avgrenser områder utenfor det samiske reinbeiteområdet der det er gitt en særskilt tillatelse til å utøve reindrift etter reindriftslovens § 8. Dette gjelder både samisk og ikke-samisk reindrift. Det er avgrenset konsesjonsområder hvor driftsform er forskjellig mellom konsesjonsområdene i tamreinlag (fire områder), konsesjonsområdet Rendalen renselskap og konsesjonsområdet Trollheimen. Datasettet beskriver ikke den forskjellige driftsformen, men avgrenser kun områdene.
description: Datasettet konsesjonsområde avgrenser områder utenfor det samiske reinbeiteområdet der det er gitt en særskilt tillatelse til å utøve reindrift etter reindriftslovens § 8. Dette gjelder både samisk og ikke-samisk reindrift. Det er avgrenset konsesjonsområder hvor driftsform er forskjellig mellom konsesjonsområdene i tamreinlag (fire områder), konsesjonsområdet Rendalen renselskap og konsesjonsområdet Trollheimen. Datasettet beskriver ikke den forskjellige driftsformen, men avgrenser kun områdene.
status: Sendt inn

Trafikkmengde
type: Concept
in scheme: FAIR-register
top concept of: FAIR-register
definition: Datasettet gir informasjon om representativ trafikkmengde for en vegstrekning på europa-, riks- eller fylkesveger. Trafikkmengden er beregnet gjennom trafikkdatasystemet, men kan også unntaksvis være subjektivt anslått. Det utgis som et årsdatasett og er sentralt i forvaltning av vegene. Vegnett som har oppstått etter årets ÅDT-beregninger vil kunne mangle data frem til neste års ÅDT-beregning. Datagrunnlaget for ÅDT-beregninger er data fra individuelle målepunkt på vegnettet (trafikkregistreringsstasjoner), disse finnes på http://trafikkdata.no
description: Datasettet gir informasjon om representativ trafikkmengde for en vegstrekning på europa-, riks- eller fylkesveger. Trafikkmengden er beregnet gjennom trafikkdatasystemet, men kan også unntaksvis være subjektivt anslått. Det utgis som et årsdatasett og er sentralt i forvaltning av vegene. Vegnett som har oppstått etter årets ÅDT-beregninger vil kunne mangle data frem til neste års ÅDT-beregning. Datagrunnlaget for ÅDT-beregninger er data fra individuelle målepunkt på vegnettet (trafikkregistreringsstasjoner), disse finnes på http://trafikkdata.no
status: Sendt inn

Naturtyper i Norge - Landskap
type: Concept
in scheme: FAIR-register
top concept of: FAIR-register
definition: NiN landskap er et system for beskrivelse av landskapsmessig variasjon som forholder seg til definisjonene i den europeiske landskapskonvensjonen og i naturmangfoldloven. NiN landskap er en del av Artsdatabanken sitt typesystem «Natur i Norge (NiN)».
description: NiN landskap er et system for beskrivelse av landskapsmessig variasjon som forholder seg til definisjonene i den europeiske landskapskonvensjonen og i naturmangfoldloven. NiN landskap er en del av Artsdatabanken sitt typesystem «Natur i Norge (NiN)».
status: Sendt inn

FKB-Bane
type: Concept
in scheme: FAIR-register
top concept of: FAIR-register
definition: FKB-Bane er en del av Felles Kartdatabase (FKB). FKB er en samling datasett som utgjør en sentral del av grunnkartet. Se metadataoppføring for Felles Kartdatabase for mer info. FKB-Bane omfatter data om infrastruktur for skinnegående kjøretøy, bl.a. jernbane, tunnelbane, forstadsbane, sporveg og kabelbane. Datasettet er avgrenset til den delen av infrastrukturen som betegnes overbygning, dvs. spor og plattform. Øvrige deler av infrastrukturen, i hovedsak underbygning (fylling, skjæring, bru, tunnel, støttemur mv), elkraftanlegg, signalanlegg og teleanlegg, omfattes av andre FKB-datasett, f.eks. FKB-Høydekurve, FKB-Bygning, FKB-BygnAnlegg og FKB-Ledning. FKB-data er ikke-sensistive og åpne data. FKB-dataene er finansiert gjennom Geovekst-samarbeidet, eller kommunene alene for kommuner som står utenfor Geovekst. FKB-dataene er fritt tilgjengelige for Norge digitalt parter og kan lastes ned gjennom nedlastingsløsningen på Geonorge. Private aktører må kjøpe tilgang til dataene gjennom en forhandler.
description: FKB-Bane er en del av Felles Kartdatabase (FKB). FKB er en samling datasett som utgjør en sentral del av grunnkartet. Se metadataoppføring for Felles Kartdatabase for mer info. FKB-Bane omfatter data om infrastruktur for skinnegående kjøretøy, bl.a. jernbane, tunnelbane, forstadsbane, sporveg og kabelbane. Datasettet er avgrenset til den delen av infrastrukturen som betegnes overbygning, dvs. spor og plattform. Øvrige deler av infrastrukturen, i hovedsak underbygning (fylling, skjæring, bru, tunnel, støttemur mv), elkraftanlegg, signalanlegg og teleanlegg, omfattes av andre FKB-datasett, f.eks. FKB-Høydekurve, FKB-Bygning, FKB-BygnAnlegg og FKB-Ledning. FKB-data er ikke-sensistive og åpne data. FKB-dataene er finansiert gjennom Geovekst-samarbeidet, eller kommunene alene for kommuner som står utenfor Geovekst. FKB-dataene er fritt tilgjengelige for Norge digitalt parter og kan lastes ned gjennom nedlastingsløsningen på Geonorge. Private aktører må kjøpe tilgang til dataene gjennom en forhandler.
status: Sendt inn

Støysoner for Bane NORs jernbanenett
type: Concept
in scheme: FAIR-register
top concept of: FAIR-register
definition: Datasettet inneheld støysonekart for Bane NORs jernbanenett utarbeidd i samsvar med "Retningslinje for behandling av støy i arealplanlegging (T-1442)". Støysonekarta viser berekna raud (Lden>68 dB) og gul (Lden>58dB) støysone.
description: Datasettet inneheld støysonekart for Bane NORs jernbanenett utarbeidd i samsvar med "Retningslinje for behandling av støy i arealplanlegging (T-1442)". Støysonekarta viser berekna raud (Lden>68 dB) og gul (Lden>58dB) støysone.
status: Sendt inn

Snøscooterløyper
type: Concept
in scheme: FAIR-register
top concept of: FAIR-register
definition: Datasettet viser snøscooterløyper som er fastsatt av kommunen etter § 4a i forskrift for bruk av motorkjøretøyer i utmark og på islagte vassdrag. Datasettet viser selve traseen og kan inneholde ytterligere informasjon om rutenavn, hjemmel for godkjenning, rutenummer, hvordan løypen er merket, tidsperioder for lovlig kjøring, steder for lovlig rasting, fartsgrenser mv.
description: Datasettet viser snøscooterløyper som er fastsatt av kommunen etter § 4a i forskrift for bruk av motorkjøretøyer i utmark og på islagte vassdrag. Datasettet viser selve traseen og kan inneholde ytterligere informasjon om rutenavn, hjemmel for godkjenning, rutenummer, hvordan løypen er merket, tidsperioder for lovlig kjøring, steder for lovlig rasting, fartsgrenser mv.
status: Sendt inn

Støysoner for Forsvarets skyte- og øvingsfelt
type: Concept
in scheme: FAIR-register
top concept of: FAIR-register
definition: Datasettet inneholder støysoner for Forsvarets skyte- og øvingsfelt. Hovedsakelig er disse beregnet etter retningslinje for behandling av støy i arealplanlegging, T-1442. Der det er aktuelt inkluderes også relevant støy fra aktiviteter som ikke er omtalt av retningslinjen, som tunge våpen, sprengninger og øving i felt (uten veldefinert standplass og skyteretning). Støysonene er ment som et hjelpemiddel i forbindelse med kommunens plan- og byggesaksarbeid. Rød sone angir områder som er sterkt berørte av støy, og er i utgangspunktet ikke egnet for støyfølsom bebyggelse. Gul sone er en vurderingssone, hvor det må planlegges godt for å oppnå tilfredsstillende støyforhold. Nye støyberegninger skal vurderes hvert 5. år eller dersom det skjer forandringer i skytefeltet/skytebanen som påvirker støybildet.
description: Datasettet inneholder støysoner for Forsvarets skyte- og øvingsfelt. Hovedsakelig er disse beregnet etter retningslinje for behandling av støy i arealplanlegging, T-1442. Der det er aktuelt inkluderes også relevant støy fra aktiviteter som ikke er omtalt av retningslinjen, som tunge våpen, sprengninger og øving i felt (uten veldefinert standplass og skyteretning). Støysonene er ment som et hjelpemiddel i forbindelse med kommunens plan- og byggesaksarbeid. Rød sone angir områder som er sterkt berørte av støy, og er i utgangspunktet ikke egnet for støyfølsom bebyggelse. Gul sone er en vurderingssone, hvor det må planlegges godt for å oppnå tilfredsstillende støyforhold. Nye støyberegninger skal vurderes hvert 5. år eller dersom det skjer forandringer i skytefeltet/skytebanen som påvirker støybildet.
status: Sendt inn

Stedsnavn
type: Concept
in scheme: FAIR-register
top concept of: FAIR-register
definition: Stedsnavn på geografiske detaljer basert på kartseriene Norge 1:50 000, økonomisk kartverk, sjøkart og navnevedtak gjort etter lov 18. mai 1990 nr.11 om stadnamn. Hvert navn har opplysninger om språk/språkform, koordinater for posisjon (punkt) , kommunetilhørighet, temakode for navnetype, vedtakstype, dato for registrering av navnevedtak og i hvilken sammenheng navnet er benyttet.
description: Stedsnavn på geografiske detaljer basert på kartseriene Norge 1:50 000, økonomisk kartverk, sjøkart og navnevedtak gjort etter lov 18. mai 1990 nr.11 om stadnamn. Hvert navn har opplysninger om språk/språkform, koordinater for posisjon (punkt) , kommunetilhørighet, temakode for navnetype, vedtakstype, dato for registrering av navnevedtak og i hvilken sammenheng navnet er benyttet.
status: Sendt inn

Jordkvalitet
type: Concept
in scheme: FAIR-register
top concept of: FAIR-register
definition: Kartet jordkvalitet viser en vurdering av jordegenskaper som er viktig for den agronomiske bruken av jorda, samt jordbruksarealets hellingsgrad. Jordkvalitetskartet er beregnet uavhengig av klima og forutsetter at jorda er drevet i henhold til god agronomisk praksis. Jordbruksarealene delt inn i tre klasser; 1 - Svært god jordkvalitet; 2 - God jordkvalitet og 3 - Mindre god jordkvalitet. Jordkvalitetskartet bygger på data som er fremskaffet gjennom en detaljert feltkartlegging av jordsmonnet basert på internasjonal metodikk og klassifikasjonssystem. Rundt halvparten av Norges fulldyrka og overflatedyrka jord er jordsmonnskartlagt. Hovedvekten av det kartlagte området finnes på Sør-Østlandet, Trøndelag og Jæren. På enkelte steder er også også innmarksbeite kartlagt.
description: Kartet jordkvalitet viser en vurdering av jordegenskaper som er viktig for den agronomiske bruken av jorda, samt jordbruksarealets hellingsgrad. Jordkvalitetskartet er beregnet uavhengig av klima og forutsetter at jorda er drevet i henhold til god agronomisk praksis. Jordbruksarealene delt inn i tre klasser; 1 - Svært god jordkvalitet; 2 - God jordkvalitet og 3 - Mindre god jordkvalitet. Jordkvalitetskartet bygger på data som er fremskaffet gjennom en detaljert feltkartlegging av jordsmonnet basert på internasjonal metodikk og klassifikasjonssystem. Rundt halvparten av Norges fulldyrka og overflatedyrka jord er jordsmonnskartlagt. Hovedvekten av det kartlagte området finnes på Sør-Østlandet, Trøndelag og Jæren. På enkelte steder er også også innmarksbeite kartlagt.
status: Sendt inn

Akvakultur - lokaliteter
type: Concept
in scheme: FAIR-register
top concept of: FAIR-register
definition: Datasettet Akvakultur - lokaliteter viser ca midtpunkt på alle akvakultur lokaliteter i Norge. Opplysninger om status tillatelse, samt fiskeart, type produksjon, kapasitet og formål inngår. Det vises også flater som er områder i sjø hvor det er gitt tillatelse til å drive med akvakulturvirksomhet. Flatene er tegnet basert på lokalitetenes klarerte ytterpunkt registrert i Fiskeridirektoratets akvakulturregister. Det er ikke alltid fisk eller skjell ved lokalitetene- dette kan sjekkes ved å se på Biomasse- ja/nei tema. Biomasse- ja/nei er basert på rapporter som viser opplysninger fra lokaliteten siste dag i hver måned. I tillegg er det informasjon om slettede/ nedlagte lokaliteter. Det har vært gitt tillatelse til akvakulturvirksomhet på lokalitetene på et tidspunkt, men tillatelsen er trukket tilbake og per dags dato er det ikke godkjent til bruk for akvakulturvirksomhet. De vises med status "TT" -Trukket tilbake, og dato for "ikke lenger gyldig".
description: Datasettet Akvakultur - lokaliteter viser ca midtpunkt på alle akvakultur lokaliteter i Norge. Opplysninger om status tillatelse, samt fiskeart, type produksjon, kapasitet og formål inngår. Det vises også flater som er områder i sjø hvor det er gitt tillatelse til å drive med akvakulturvirksomhet. Flatene er tegnet basert på lokalitetenes klarerte ytterpunkt registrert i Fiskeridirektoratets akvakulturregister. Det er ikke alltid fisk eller skjell ved lokalitetene- dette kan sjekkes ved å se på Biomasse- ja/nei tema. Biomasse- ja/nei er basert på rapporter som viser opplysninger fra lokaliteten siste dag i hver måned. I tillegg er det informasjon om slettede/ nedlagte lokaliteter. Det har vært gitt tillatelse til akvakulturvirksomhet på lokalitetene på et tidspunkt, men tillatelsen er trukket tilbake og per dags dato er det ikke godkjent til bruk for akvakulturvirksomhet. De vises med status "TT" -Trukket tilbake, og dato for "ikke lenger gyldig".
status: Sendt inn

Reindrift - Reinbeitedistrikt
type: Concept
in scheme: FAIR-register
top concept of: FAIR-register
definition: Datasettet reinbeitedistrikt viser administrativ og geografisk inndeling av reinbeitedistrikter i det samiske reinbeiteområdet. Retten til å utøve reindrift innenfor disse områdene er eksklusiv for den samiske befolkningen. Denne samiske særretten gjelder ikke utenfor disse områdene, hvor det kreves særskilt tillatelse for å utøve reindrift på egne og leide arealer. Et reinbeitedistrikt utgjør en administrativ enhet for en eller flere siidaer. Statsforvalteren er forvaltningsmyndighet for reinbeitedistriktene.
description: Datasettet reinbeitedistrikt viser administrativ og geografisk inndeling av reinbeitedistrikter i det samiske reinbeiteområdet. Retten til å utøve reindrift innenfor disse områdene er eksklusiv for den samiske befolkningen. Denne samiske særretten gjelder ikke utenfor disse områdene, hvor det kreves særskilt tillatelse for å utøve reindrift på egne og leide arealer. Et reinbeitedistrikt utgjør en administrativ enhet for en eller flere siidaer. Statsforvalteren er forvaltningsmyndighet for reinbeitedistriktene.
status: Sendt inn

Kulturminner - Verneverdig tette trehusmiljøer
type: Concept
in scheme: FAIR-register
top concept of: FAIR-register
definition: Datasettet dekker områder som Riksantikvaren definerer som verneverdig tette trehusmiljøer. Områder der det må tas særskilte brannvernhensyn. Tett bebyggelse med trehus er spesielt sårbar om det skulle oppstå brann. De største områdene med sammenhengende, gammel trehusbebyggelse har vi i byer, for eksempel i Halden sentrum, gamle Stavanger og i store deler av Trondheim. Tette trehusmiljøer finnes imidlertid også på større gårdstun, som Havråtunet i Hordaland, og i gamle fiskevær, som Sør-Gjæslingan i Nord-Trøndelag. I tillegg til dette datasettet, finnes datasettet Brannsmitteområder, som viser områder med verneverdig tett trehusbebyggelse der det er spesielt stor fare for at brann i en bygning skal smitte over på de øvrig.
description: Datasettet dekker områder som Riksantikvaren definerer som verneverdig tette trehusmiljøer. Områder der det må tas særskilte brannvernhensyn. Tett bebyggelse med trehus er spesielt sårbar om det skulle oppstå brann. De største områdene med sammenhengende, gammel trehusbebyggelse har vi i byer, for eksempel i Halden sentrum, gamle Stavanger og i store deler av Trondheim. Tette trehusmiljøer finnes imidlertid også på større gårdstun, som Havråtunet i Hordaland, og i gamle fiskevær, som Sør-Gjæslingan i Nord-Trøndelag. I tillegg til dette datasettet, finnes datasettet Brannsmitteområder, som viser områder med verneverdig tett trehusbebyggelse der det er spesielt stor fare for at brann i en bygning skal smitte over på de øvrig.
status: Sendt inn

Aktsomhetskart for snøskred
type: Concept
in scheme: FAIR-register
top concept of: FAIR-register
definition: Aktsomhetskart for snøskred er et GIS-generert landsdekkende datasett som gir en grov oversikt over områder som potensielt kan være snøskredutsatt. Aktsomhetskartet ble ferdigtstilt i 2023 med ny metodikk. Kartet er utviklet av Norges Geotekniske Institutt (NGI) og blir forvaltet av NVE. Nye aktsomhetskart for snøskred 2023 finnes i tre forskjellige utgaver: Aktsomhetskart snøskred S3 til bruk i kommuneplan for å avklare sikkerhet for bygg opp til sikkerhetsklasse S3. Kartet er sammensatt av aktsomhetskart for snøskred fra 2010 og Aktsomhetskart for snøskred S2 uten skog fra 2023. Aktsomhetskart snøskred S2 uten skogeffekt til å avklare sikkerhet for bygg opp til og med sikkerhetsklasse S2 uten å måtte båndlegge skog. Aktsomhetskart snøskred S2 med skogeffekt til å avklare sikkerhet for bygg opp til sikkerhetsklasse S2, dersom skogen sin sikringseffekt er sikret. Nasjonal høydemodell er brukt som grunnlag for å identifisere områder der snøskred kan løsne. Klimadata fra SeNorge og skogdata fra SR16-datasettet til NIBIO er brukt til å estimere snømengder og sannsynlighet for skred. Kartet bruker en dynamisk utløpsmodell som gir utløpssoner som er mer tilpasset terrenget og dermed gir mer realistiske utløpssoner enn tidligere aktsomhetskart.
description: Aktsomhetskart for snøskred er et GIS-generert landsdekkende datasett som gir en grov oversikt over områder som potensielt kan være snøskredutsatt. Aktsomhetskartet ble ferdigtstilt i 2023 med ny metodikk. Kartet er utviklet av Norges Geotekniske Institutt (NGI) og blir forvaltet av NVE. Nye aktsomhetskart for snøskred 2023 finnes i tre forskjellige utgaver: Aktsomhetskart snøskred S3 til bruk i kommuneplan for å avklare sikkerhet for bygg opp til sikkerhetsklasse S3. Kartet er sammensatt av aktsomhetskart for snøskred fra 2010 og Aktsomhetskart for snøskred S2 uten skog fra 2023. Aktsomhetskart snøskred S2 uten skogeffekt til å avklare sikkerhet for bygg opp til og med sikkerhetsklasse S2 uten å måtte båndlegge skog. Aktsomhetskart snøskred S2 med skogeffekt til å avklare sikkerhet for bygg opp til sikkerhetsklasse S2, dersom skogen sin sikringseffekt er sikret. Nasjonal høydemodell er brukt som grunnlag for å identifisere områder der snøskred kan løsne. Klimadata fra SeNorge og skogdata fra SR16-datasettet til NIBIO er brukt til å estimere snømengder og sannsynlighet for skred. Kartet bruker en dynamisk utløpsmodell som gir utløpssoner som er mer tilpasset terrenget og dermed gir mer realistiske utløpssoner enn tidligere aktsomhetskart.
status: Sendt inn

Reindrift - Flyttlei
type: Concept
in scheme: FAIR-register
top concept of: FAIR-register
definition: Datasettet flyttlei beskriver lengre leier eller traséer i terrenget der reinen enten drives/ledes/føres eller trekker selv mellom årstidsbeitene. Også svømmelei inngår som flyttlei. Bredden på en flyttlei varierer ut ifra terreng og måten det flyttes på. Det kan være en aktiv driving av reinen, eller at reinen styres i ønsket retning, hvor reinen får beite seg gjennom et område. Enkelte steder er det utvidelser på flyttleia. Disse utvidelsene markerer beitelommer eller overnattingsbeiter hvor flokken hviler/beiter. Bredden vil variere, blant annet etter terrenget og snøforholdene samt størrelsen og samlingen på flokken. Beitelommer/ overnattingsbeite er markert som utvidelser. Høstflyttingen foregår som oftest mer spredt og over adskillig lenger tid enn vår-flyttingen. Derfor er ofte høstleia bredere. Datasettet viser dagens arealbruk og er å regne som veiledende illustrasjon på hvordan reindriftsnæringen i hovedsak og normalt bruker områdene.
description: Datasettet flyttlei beskriver lengre leier eller traséer i terrenget der reinen enten drives/ledes/føres eller trekker selv mellom årstidsbeitene. Også svømmelei inngår som flyttlei. Bredden på en flyttlei varierer ut ifra terreng og måten det flyttes på. Det kan være en aktiv driving av reinen, eller at reinen styres i ønsket retning, hvor reinen får beite seg gjennom et område. Enkelte steder er det utvidelser på flyttleia. Disse utvidelsene markerer beitelommer eller overnattingsbeiter hvor flokken hviler/beiter. Bredden vil variere, blant annet etter terrenget og snøforholdene samt størrelsen og samlingen på flokken. Beitelommer/ overnattingsbeite er markert som utvidelser. Høstflyttingen foregår som oftest mer spredt og over adskillig lenger tid enn vår-flyttingen. Derfor er ofte høstleia bredere. Datasettet viser dagens arealbruk og er å regne som veiledende illustrasjon på hvordan reindriftsnæringen i hovedsak og normalt bruker områdene.
status: Sendt inn

N5 Presentasjonsdata
type: Concept
in scheme: FAIR-register
top concept of: FAIR-register
definition: N5 Presentasjonsdata er presentasjonsdata for FKB og andre primærdata tilpasset presentasjon i målestokker omkring 1:5000. N5 Presentasjonsdata inngår som del av produktet N5 Kartdata og benyttes ved produksjon av N5 Raster. N5 Presentasjonsdata avløser det tidligere produktet FKB-Tekst5000.
description: N5 Presentasjonsdata er presentasjonsdata for FKB og andre primærdata tilpasset presentasjon i målestokker omkring 1:5000. N5 Presentasjonsdata inngår som del av produktet N5 Kartdata og benyttes ved produksjon av N5 Raster. N5 Presentasjonsdata avløser det tidligere produktet FKB-Tekst5000.
status: Sendt inn

Store fjellskred
type: Concept
in scheme: FAIR-register
top concept of: FAIR-register
definition: Dette produktet er et resultat av at NVE overtok det statlige forvaltningsansvaret for skred i 2009. Tjenesten er ment som et hjelpemiddel som gjør det enklere å skaffe oversikt over ustabile fjellparti og tilhørende konsekvenser. Fare- og risikokartlegging gjennomføres av NGU på vegne av NVE. Hvordan oppfølgingen av de ustabile fjellpartiene og faresonene bør følges opp med overvåking og i arealplanlegging er beskrevet i NVE rapport 77/2016: Fare og risikoklassifisering av ustabile fjellparti. Det er etablert to databaser for formidling av kartleggingen og fareområdene. NVEs database formidler faresoner for utløpsområder og flodbølger, samt potensielle oppdemmingsområder og nedstrøms flom som følge av dambrudd der dette er aktuelt. NGUs database har fokus på de geologiske data, inkludert bevegelsesmålinger. NVEs kartlegging retter seg først og fremst mot eksisterende bebyggelse. Ved identifisering og prioritering av områder som har behov for kontinuerlig overvåking er det derfor lagt vekt på hvor det bor og oppholder seg mennesker innenfor potensielt skredfareutsatte områder og områder som blir berørt av flodbølger eller oppdemning/dambrudd som en direkte konsekvens av et fjellskred. Databasen er et produkt av den kartleggingen og fare- og risikoklassifiseringen som er gjort. Sammen skal dette gi grunnlag for å vurdere tiltak i form av overvåking med sikte på å kunne varsle et kommende fjellskred og dermed unngå potensielt tap av menneskeliv. Kartleggingen gir viktig informasjon om faregraden som grunnlag for arealplanlegging.
description: Dette produktet er et resultat av at NVE overtok det statlige forvaltningsansvaret for skred i 2009. Tjenesten er ment som et hjelpemiddel som gjør det enklere å skaffe oversikt over ustabile fjellparti og tilhørende konsekvenser. Fare- og risikokartlegging gjennomføres av NGU på vegne av NVE. Hvordan oppfølgingen av de ustabile fjellpartiene og faresonene bør følges opp med overvåking og i arealplanlegging er beskrevet i NVE rapport 77/2016: Fare og risikoklassifisering av ustabile fjellparti. Det er etablert to databaser for formidling av kartleggingen og fareområdene. NVEs database formidler faresoner for utløpsområder og flodbølger, samt potensielle oppdemmingsområder og nedstrøms flom som følge av dambrudd der dette er aktuelt. NGUs database har fokus på de geologiske data, inkludert bevegelsesmålinger. NVEs kartlegging retter seg først og fremst mot eksisterende bebyggelse. Ved identifisering og prioritering av områder som har behov for kontinuerlig overvåking er det derfor lagt vekt på hvor det bor og oppholder seg mennesker innenfor potensielt skredfareutsatte områder og områder som blir berørt av flodbølger eller oppdemning/dambrudd som en direkte konsekvens av et fjellskred. Databasen er et produkt av den kartleggingen og fare- og risikoklassifiseringen som er gjort. Sammen skal dette gi grunnlag for å vurdere tiltak i form av overvåking med sikte på å kunne varsle et kommende fjellskred og dermed unngå potensielt tap av menneskeliv. Kartleggingen gir viktig informasjon om faregraden som grunnlag for arealplanlegging.
status: Sendt inn

Tare - høstefelt
type: Concept
in scheme: FAIR-register
top concept of: FAIR-register
definition: Arealavgrensete felt hvor det innenfor angitte tidsrom kan høstes tare med trål. Innenfor feltene er det stengte områder hvor det er forbudt å høste tare. Også innenfor feltene er det referanseområder hvor det er ikke tillatt å høste tare uten særskilt tillatelse fra Fiskeridirektoratet. Hoved forskrift finnes på www.fiskeridir.no og https://lovdata.no/dokument/SF/forskrift/1995-07-13-642 Høstefeltene er spesifiserte i tre forskrift: Rogaland og Vestland; Møre og Romsdal og Trøndelag; Nordland sør av Vegaøyan verdensarvområde Feltgrenser følger langs hele bredde- og lengdeminutter, med bredde på 1 nautisk mil for hvert høstefelt i Rogaland, Vestland, Møre og Romsdal og Trøndelag. I Nordland har høstefelt 1/2 nautisk mil der grensen mellom feltene følger hvert 1/2 breddeminutt. Se forskrift for mer informasjon om hvilke felt som er åpne.
description: Arealavgrensete felt hvor det innenfor angitte tidsrom kan høstes tare med trål. Innenfor feltene er det stengte områder hvor det er forbudt å høste tare. Også innenfor feltene er det referanseområder hvor det er ikke tillatt å høste tare uten særskilt tillatelse fra Fiskeridirektoratet. Hoved forskrift finnes på www.fiskeridir.no og https://lovdata.no/dokument/SF/forskrift/1995-07-13-642 Høstefeltene er spesifiserte i tre forskrift: Rogaland og Vestland; Møre og Romsdal og Trøndelag; Nordland sør av Vegaøyan verdensarvområde Feltgrenser følger langs hele bredde- og lengdeminutter, med bredde på 1 nautisk mil for hvert høstefelt i Rogaland, Vestland, Møre og Romsdal og Trøndelag. I Nordland har høstefelt 1/2 nautisk mil der grensen mellom feltene følger hvert 1/2 breddeminutt. Se forskrift for mer informasjon om hvilke felt som er åpne.
status: Sendt inn

Reindrift - Samebyavtale
type: Concept
in scheme: FAIR-register
top concept of: FAIR-register
definition: Samebyavtale viser grenser for svenske reineieres (samebyers) beiteområder i Norge, i henhold til private avtaler mellom svenske samebyer og norske reinbeitedistrikter. Samebyer i Sverige er økonomiske og administrative enheter med eget styre, i likhet med reinbeitedistrikter i Norge. Datasettet anbefales brukt sammen med to andre datasett som viser svenske reineieres rettigheter i Norge, “Reindrift - Konvensjonsområde” og “Reindrift - Samebyrettsavgjørelse”. Reindrift er en nomadisk næring med en syklisk veksling mellom beiter tilpasset reinens krav i den enkelte årstid. Årlige variasjoner i blant annet vær- og beiteforhold gjør at bruken av årstidsbeitene vil variere i både tid og utstrekning fra år til år.
description: Samebyavtale viser grenser for svenske reineieres (samebyers) beiteområder i Norge, i henhold til private avtaler mellom svenske samebyer og norske reinbeitedistrikter. Samebyer i Sverige er økonomiske og administrative enheter med eget styre, i likhet med reinbeitedistrikter i Norge. Datasettet anbefales brukt sammen med to andre datasett som viser svenske reineieres rettigheter i Norge, “Reindrift - Konvensjonsområde” og “Reindrift - Samebyrettsavgjørelse”. Reindrift er en nomadisk næring med en syklisk veksling mellom beiter tilpasset reinens krav i den enkelte årstid. Årlige variasjoner i blant annet vær- og beiteforhold gjør at bruken av årstidsbeitene vil variere i både tid og utstrekning fra år til år.
status: Sendt inn

Sensitive artsdata
type: Concept
in scheme: FAIR-register
top concept of: FAIR-register
definition: Sensitive artsdata er samlebegrep for en database med utvalgte arter av fugler, pattedyr og lav hvor stedfestet informasjon om artenes hekkeområde, yngleområde eller voksested er skjermet for allment innsyn. Begrunnelsen for at stedfestet informasjon om disse artene bør skjermes, er at åpen tilgang kan føre til at arten eller stedet der den forekommer utsettes for uheldige negative påvirkninger. Det kan være eksempelvis forstyrrelse, etterstrebelse, eller ødeleggelse. Data er publisert gjennom en passordbeskyttet løsning som viser eksakt lokalisering av objektene. Fylkesmannen og Miljødirektoratet kan gi tilgang til denne. Data er også publisert gjennom en åpen løsning som viser maskerte data, i form av ruter med varierende størrelse, avhengig av art.
description: Sensitive artsdata er samlebegrep for en database med utvalgte arter av fugler, pattedyr og lav hvor stedfestet informasjon om artenes hekkeområde, yngleområde eller voksested er skjermet for allment innsyn. Begrunnelsen for at stedfestet informasjon om disse artene bør skjermes, er at åpen tilgang kan føre til at arten eller stedet der den forekommer utsettes for uheldige negative påvirkninger. Det kan være eksempelvis forstyrrelse, etterstrebelse, eller ødeleggelse. Data er publisert gjennom en passordbeskyttet løsning som viser eksakt lokalisering av objektene. Fylkesmannen og Miljødirektoratet kan gi tilgang til denne. Data er også publisert gjennom en åpen løsning som viser maskerte data, i form av ruter med varierende størrelse, avhengig av art.
status: Sendt inn

Naturvernområder - Foreslåtte
type: Concept
in scheme: FAIR-register
top concept of: FAIR-register
definition: Datasettet viser områder som er under planlegging og sendt på offentlig høring etter lov om Naturmangfold - Kapittel V. Områdevern. Verneområder opprettes først og fremst for å bevare naturverdier av nasjonal betydning. Dette er verdier vi skal ta vare på for all overskuelig framtid, også med tanke på naturopplevelse og kunnskap om naturen. Verneområdene forvaltes av fylkesmannen, kommunen, et nasjonalparkstyre eller et interkommunalt verneområdestyre Datasettet har nær sammenheng med datasettet Naturvernområder. Når et verneforslag blir vedtatt, slettes kartobjektet fra Foreslåtte naturvernområder og opprettes isteden i datasett Naturvernområder.
description: Datasettet viser områder som er under planlegging og sendt på offentlig høring etter lov om Naturmangfold - Kapittel V. Områdevern. Verneområder opprettes først og fremst for å bevare naturverdier av nasjonal betydning. Dette er verdier vi skal ta vare på for all overskuelig framtid, også med tanke på naturopplevelse og kunnskap om naturen. Verneområdene forvaltes av fylkesmannen, kommunen, et nasjonalparkstyre eller et interkommunalt verneområdestyre Datasettet har nær sammenheng med datasettet Naturvernområder. Når et verneforslag blir vedtatt, slettes kartobjektet fra Foreslåtte naturvernområder og opprettes isteden i datasett Naturvernområder.
status: Sendt inn

Verneplan for vassdrag
type: Concept
in scheme: FAIR-register
top concept of: FAIR-register
definition: Database over vassdrag verna mot kraftutbygging. Egenskapsdata er verneplannavn. og id., verneplannr., dato for vern, areal og vassdragsnr.
description: Database over vassdrag verna mot kraftutbygging. Egenskapsdata er verneplannavn. og id., verneplannr., dato for vern, areal og vassdragsnr.
status: Sendt inn

Reindrift - Årstidsbeite - Vinterbeite
type: Concept
in scheme: FAIR-register
top concept of: FAIR-register
definition: Vinterbeite er ett av fem datasett som til sammen beskriver reindriftens årstidsbeiter. Det viser områder som reinen bruker på vinteren, og det skilles mellom tidlig vinterland og senvinterland. Tidlig vinterland er områder hvor reinen oppholder seg tidlig i vintersesongen. Senvinterland er de deler av vinterområdene som normalt er mest sikre mot store snømengder og nedising på midt- og senvinteren. Reindrift er en nomadisk næring med en syklisk veksling mellom beiter tilpasset reinens krav i den enkelte årstid. Et reindriftsår er inndelt i fem ulike årstider med tilhørende årstidsbeiter. Årlige variasjonene iblant annet vær- og beiteforhold gjør at bruken av årstidsbeitene vil variere i både tid og utstrekning fra år til år.
description: Vinterbeite er ett av fem datasett som til sammen beskriver reindriftens årstidsbeiter. Det viser områder som reinen bruker på vinteren, og det skilles mellom tidlig vinterland og senvinterland. Tidlig vinterland er områder hvor reinen oppholder seg tidlig i vintersesongen. Senvinterland er de deler av vinterområdene som normalt er mest sikre mot store snømengder og nedising på midt- og senvinteren. Reindrift er en nomadisk næring med en syklisk veksling mellom beiter tilpasset reinens krav i den enkelte årstid. Et reindriftsår er inndelt i fem ulike årstider med tilhørende årstidsbeiter. Årlige variasjonene iblant annet vær- og beiteforhold gjør at bruken av årstidsbeitene vil variere i både tid og utstrekning fra år til år.
status: Sendt inn

Forurenset grunn
type: Concept
in scheme: FAIR-register
top concept of: FAIR-register
definition: Datasettet omfatter eiendommer med forurenset grunn samt kommunale og private-/ industrideponier. Datasettet er fremskaffet ved kartlegging av lokaliteter med forurenset grunn og/eller med mistanke om forurenset grunn og ved innrapporteringer gjort i forbindelse med bygge- og gravesaker, pålegg om undersøkelser etter tiltak eller på eget initiativ.
description: Datasettet omfatter eiendommer med forurenset grunn samt kommunale og private-/ industrideponier. Datasettet er fremskaffet ved kartlegging av lokaliteter med forurenset grunn og/eller med mistanke om forurenset grunn og ved innrapporteringer gjort i forbindelse med bygge- og gravesaker, pålegg om undersøkelser etter tiltak eller på eget initiativ.
status: Sendt inn

Kulturminner - Brannsmitteområder
type: Concept
in scheme: FAIR-register
top concept of: FAIR-register
definition: Datasettet dekker områder med verneverdig tett trehusbebyggelse (som finnes som et eget datasett) der det er spesielt stor fare for at brann i en bygning skal smitte over på de øvrige. Områdene er definert av Direktoratet for samfunnssikkerhet og beredskap (DSB) i samarbeid med Riksantikvaren.
description: Datasettet dekker områder med verneverdig tett trehusbebyggelse (som finnes som et eget datasett) der det er spesielt stor fare for at brann i en bygning skal smitte over på de øvrige. Områdene er definert av Direktoratet for samfunnssikkerhet og beredskap (DSB) i samarbeid med Riksantikvaren.
status: Sendt inn

Vernskog
type: Concept
in scheme: FAIR-register
top concept of: FAIR-register
definition: I henhold til Skogbruksloven § 12, anses skog som vernskog når den tjener til vern for annen skog eller gir vern mot naturskader. Det samme gjelder områder opp mot fjellet, mot nord eller ut mot havet der skogen er sårbar og kan bli ødelagt ved feil skogbehandling. Det er Statsforvalterens landbruksavdeling som har ansvar for forskrift og kartlegging av vernskoggrensene. Vernskog er samlet inn og er tilgjengelig for de områdene hvor data er sendt inn digitalt av Statsforvalterens landbruksavdelingen. Landbruksdirektoratet er nasjonal koordinator og fagmyndighet.
description: I henhold til Skogbruksloven § 12, anses skog som vernskog når den tjener til vern for annen skog eller gir vern mot naturskader. Det samme gjelder områder opp mot fjellet, mot nord eller ut mot havet der skogen er sårbar og kan bli ødelagt ved feil skogbehandling. Det er Statsforvalterens landbruksavdeling som har ansvar for forskrift og kartlegging av vernskoggrensene. Vernskog er samlet inn og er tilgjengelig for de områdene hvor data er sendt inn digitalt av Statsforvalterens landbruksavdelingen. Landbruksdirektoratet er nasjonal koordinator og fagmyndighet.
status: Sendt inn

Grunnvannsborehull
type: Concept
in scheme: FAIR-register
top concept of: FAIR-register
definition: Datasettet gir en landsdekkende oversikt over borede grunnvannsbrønner, energibrønner og naturlige oppkommer av grunnvann (tidligere kalt kilder). Datasettet viser lokalisering og tekniske, administrative og geologiske forhold registrert for grunnvanns- og energibrønner. Oftest er de registrert av borefirma iht. oppgaveplikten etter Vannressursloven §46. Dataene er tilgjengelig i GRANADA - Nasjonal grunnvannsdatabase https://geo.ngu.no/kart/granada_mobil/
description: Datasettet gir en landsdekkende oversikt over borede grunnvannsbrønner, energibrønner og naturlige oppkommer av grunnvann (tidligere kalt kilder). Datasettet viser lokalisering og tekniske, administrative og geologiske forhold registrert for grunnvanns- og energibrønner. Oftest er de registrert av borefirma iht. oppgaveplikten etter Vannressursloven §46. Dataene er tilgjengelig i GRANADA - Nasjonal grunnvannsdatabase https://geo.ngu.no/kart/granada_mobil/
status: Sendt inn

Kulturminner - Lokaliteter, Enkeltminner og Sikringssoner
type: Concept
in scheme: FAIR-register
top concept of: FAIR-register
definition: Datasettet Kulturminner – Lokaliteter, Enkeltminner og Sikringssoner inneholder alle kulturminner på fastlands-Norge og Svalbard (bortsett fra kulturminner som har begrenset offentlighet) som er registrert i Riksantikvarens offisielle database over kulturminner og kulturmiljøer, Askeladden, uavhengig av vernestatus. Et kulturminne er i denne sammenhengen en helhet bestående av en lokalitet med et eller flere enkeltminner, samt sikringssoner (hvis vernestatus tilsier det). Overordnet kan man si at et enkeltminne representerer et fysisk kulturminne, med dets geografiske utstrekning og informasjon som er spesifikt for det. En lokalitet representerer et geografisk område som inneholder et eller flere enkeltminner som hører sammen på en eller annen måte. Lokaliteten inneholder generell informasjon om dette området, samt informasjon om høyeste vern («høyesteVern») blant enkeltminnene innenfor. Eksempelvis vil et gravfelt utgjøre en lokalitet, mens gravhaug(er)/gravrøys(er) i gravfeltet utgjør enkeltminner. For nyere tids kulturminner kan lokaliteten være ett anlegg som er representert av et enkelt bygg, et gårdstun bestående av flere bygninger, eller én eller flere bygninger med et vedtaksfredet område rundt (park, hage, o.l.). En sikringssone er et geografisk område rundt automatisk fredede kulturminner. Området er ment for å gi et ekstra vern mot tiltak, og er derfor særlig viktig å ta hensyn til.
description: Datasettet Kulturminner – Lokaliteter, Enkeltminner og Sikringssoner inneholder alle kulturminner på fastlands-Norge og Svalbard (bortsett fra kulturminner som har begrenset offentlighet) som er registrert i Riksantikvarens offisielle database over kulturminner og kulturmiljøer, Askeladden, uavhengig av vernestatus. Et kulturminne er i denne sammenhengen en helhet bestående av en lokalitet med et eller flere enkeltminner, samt sikringssoner (hvis vernestatus tilsier det). Overordnet kan man si at et enkeltminne representerer et fysisk kulturminne, med dets geografiske utstrekning og informasjon som er spesifikt for det. En lokalitet representerer et geografisk område som inneholder et eller flere enkeltminner som hører sammen på en eller annen måte. Lokaliteten inneholder generell informasjon om dette området, samt informasjon om høyeste vern («høyesteVern») blant enkeltminnene innenfor. Eksempelvis vil et gravfelt utgjøre en lokalitet, mens gravhaug(er)/gravrøys(er) i gravfeltet utgjør enkeltminner. For nyere tids kulturminner kan lokaliteten være ett anlegg som er representert av et enkelt bygg, et gårdstun bestående av flere bygninger, eller én eller flere bygninger med et vedtaksfredet område rundt (park, hage, o.l.). En sikringssone er et geografisk område rundt automatisk fredede kulturminner. Området er ment for å gi et ekstra vern mot tiltak, og er derfor særlig viktig å ta hensyn til.
status: Sendt inn

Korallrev
type: Concept
in scheme: FAIR-register
top concept of: FAIR-register
definition: Kartet viser dokumenterte og stedfestede korallrev av steinkorallen Lophelia pertusa (Desmophyllum pertusum). Forekomstene av korallrev er angitt som punkter på kart. Disse utgjør verdifull informasjon som beslutningsgrunnlag ved vurdering av nye oppdrettskonsesjoner, utslipp i sjø, deponering, utbygging av petroleumsrelaterte installasjoner, og regulering av fiskeriaktivitet. For mer informasjon om korallrev se: https://www.mareano.no/tema/kaldtvannskoraller/korallrev-1 Visning på MAREANO kartportal: https://kart.mareano.no/mareano/mareanoPolar.html?#maps/7555
description: Kartet viser dokumenterte og stedfestede korallrev av steinkorallen Lophelia pertusa (Desmophyllum pertusum). Forekomstene av korallrev er angitt som punkter på kart. Disse utgjør verdifull informasjon som beslutningsgrunnlag ved vurdering av nye oppdrettskonsesjoner, utslipp i sjø, deponering, utbygging av petroleumsrelaterte installasjoner, og regulering av fiskeriaktivitet. For mer informasjon om korallrev se: https://www.mareano.no/tema/kaldtvannskoraller/korallrev-1 Visning på MAREANO kartportal: https://kart.mareano.no/mareano/mareanoPolar.html?#maps/7555
status: Sendt inn

Forenklet Elveg 2.0
type: Concept
in scheme: FAIR-register
top concept of: FAIR-register
definition: Forenklet Elveg 2.0 er en forenklet utgave av vegnettsdatasettet Elveg 2.0 og inneholder kun veglenkegeometri og vegsperringer. Dette datasettet erstatter Vbase. Det omfatter alle kjørbare veger som er lengre enn 50 meter, eller er en del av et nettverk, samt gang- og sykkelveger og sykkelveger representert som veglenkegeometri. Fortau, gangveger og gangfelt som tidligere fantes i FKB-TraktorvegSti skal også bli en del av Forenklet Elveg 2.0 i løpet av 2022. Forenklet Elveg 2.0 er en eksport fra Nasjonal vegdatabank (NVDB) og ajourholdes av Statens vegvesen og Kartverket. Leveranse består av lands-, fylkes- og kommunevise filer. Oppdateres og utgis ukentlig.
description: Forenklet Elveg 2.0 er en forenklet utgave av vegnettsdatasettet Elveg 2.0 og inneholder kun veglenkegeometri og vegsperringer. Dette datasettet erstatter Vbase. Det omfatter alle kjørbare veger som er lengre enn 50 meter, eller er en del av et nettverk, samt gang- og sykkelveger og sykkelveger representert som veglenkegeometri. Fortau, gangveger og gangfelt som tidligere fantes i FKB-TraktorvegSti skal også bli en del av Forenklet Elveg 2.0 i løpet av 2022. Forenklet Elveg 2.0 er en eksport fra Nasjonal vegdatabank (NVDB) og ajourholdes av Statens vegvesen og Kartverket. Leveranse består av lands-, fylkes- og kommunevise filer. Oppdateres og utgis ukentlig.
status: Sendt inn

Anlegg med farlig stoff
type: Concept
in scheme: FAIR-register
top concept of: FAIR-register
definition: Datasettet viser anlegg med farlig stoff, dvs. brannfarlig og giftig gass, stoff og væske. Dataene er etablert ved innmelding fra eierne av anleggene. DSB har derfor liten kontroll med kvaliteten på stedfestingen. DSB gjør disse dataene tilgjengelig bare for utvalgte brukere innenfor Norge digitalt. Dette vil særlig være brukere innenfor arealplanlegging, byggesaksbehandling og beredskap. Disse får bare tilgang til data for eget distrikt ved direkte henvendelse til DSB ved kart@dsb.no. Brukeretatene må forplikte seg til å behandle dataene slik at de bare er tilgjengelig for brukere med reelt behov for informasjonen. Dataene kan ikke legges på åpne kartapplikasjoner på internett. DSB har en online-løsning, FAST, som krever brukernavn og passord, og som gjøres tilgjengelig for de samme brukergruppene som vektordataene. FAST består av en kartløsning med farlig stoff-dataene og en database med mer informasjon om anleggene. Se DSBs nettsider https://www.dsb.no/farlige-stoffer/farlige-stoffer/informasjon-og-verktoy/fast---anlegg-og-kart/
description: Datasettet viser anlegg med farlig stoff, dvs. brannfarlig og giftig gass, stoff og væske. Dataene er etablert ved innmelding fra eierne av anleggene. DSB har derfor liten kontroll med kvaliteten på stedfestingen. DSB gjør disse dataene tilgjengelig bare for utvalgte brukere innenfor Norge digitalt. Dette vil særlig være brukere innenfor arealplanlegging, byggesaksbehandling og beredskap. Disse får bare tilgang til data for eget distrikt ved direkte henvendelse til DSB ved kart@dsb.no. Brukeretatene må forplikte seg til å behandle dataene slik at de bare er tilgjengelig for brukere med reelt behov for informasjonen. Dataene kan ikke legges på åpne kartapplikasjoner på internett. DSB har en online-løsning, FAST, som krever brukernavn og passord, og som gjøres tilgjengelig for de samme brukergruppene som vektordataene. FAST består av en kartløsning med farlig stoff-dataene og en database med mer informasjon om anleggene. Se DSBs nettsider https://www.dsb.no/farlige-stoffer/farlige-stoffer/informasjon-og-verktoy/fast---anlegg-og-kart/
status: Sendt inn