EPSG koder
type: ConceptScheme
description: Inneholder oversikt over EPSG koder som benyttes i Norge Digitalt omtalt i rammeverksdokumentet

EUREF89 NTM Sone 25, 2d
type: Concept
in scheme: EPSG koder
top concept of: EPSG koder
definition: Norsk Transversal Mercator sone 25 (basert på EUREF89)
description: Norsk Transversal Mercator sone 25 (basert på EUREF89)
status: Sendt inn

EUREF89 UTM sone 29, 2d
type: Concept
in scheme: EPSG koder
top concept of: EPSG koder
definition: UTM er en Gauss-Krüger projeksjon med 6° sonebredde. Berøringsmeridianen er -9°vest for Greenwich.
description: UTM er en Gauss-Krüger projeksjon med 6° sonebredde. Berøringsmeridianen er -9°vest for Greenwich.
status: Gyldig

EUREF89 UTM sone 34, 2d
type: Concept
in scheme: EPSG koder
top concept of: EPSG koder
definition: UTM er en Gauss-Krüger projeksjon med 6° sonebredde. Berøringsmeridianen er 21° øst for Greenwich.
description: UTM er en Gauss-Krüger projeksjon med 6° sonebredde. Berøringsmeridianen er 21° øst for Greenwich.
status: Sendt inn

EUREF89 UTM sone 36, 2d + NN2000
type: Concept
in scheme: EPSG koder
top concept of: EPSG koder
definition: Koordinatsystemet er sammensatt og angir vertikalt datum NN2000 i tillegg til UTM sone 36 i EUREF89. Dekker Norges fastland mellom 30°E og 36°E. Berøringsmeridianen er 33° øst for Greenwich.
description: Koordinatsystemet er sammensatt og angir vertikalt datum NN2000 i tillegg til UTM sone 36 i EUREF89. Dekker Norges fastland mellom 30°E og 36°E. Berøringsmeridianen er 33° øst for Greenwich.
status: Sendt inn

EUREF89 NTM Sone 11, 2d
type: Concept
in scheme: EPSG koder
top concept of: EPSG koder
definition: Norsk Transversal Mercator sone 11 (basert på EUREF89)
description: Norsk Transversal Mercator sone 11 (basert på EUREF89)
status: Sendt inn

EUREF89 NTM Sone 21, 2d + NN54
type: Concept
in scheme: EPSG koder
top concept of: EPSG koder
definition: Koordinatsystemet er sammensatt og angir vertikalt datum NN54 i tillegg til Norsk Transversal Mercator sone 21 (basert på EUREF89)
description: Koordinatsystemet er sammensatt og angir vertikalt datum NN54 i tillegg til Norsk Transversal Mercator sone 21 (basert på EUREF89)
status: Sendt inn

EUREF89 NTM Sone 17, 2d + NN54
type: Concept
in scheme: EPSG koder
top concept of: EPSG koder
definition: Koordinatsystemet er sammensatt og angir vertikalt datum NN54 i tillegg til Norsk Transversal Mercator sone 17 (basert på EUREF89)
description: Koordinatsystemet er sammensatt og angir vertikalt datum NN54 i tillegg til Norsk Transversal Mercator sone 17 (basert på EUREF89)
status: Sendt inn

EUREF89 NTM Sone 18, 2d + NN2000
type: Concept
in scheme: EPSG koder
top concept of: EPSG koder
definition: Koordinatsystemet er sammensatt og angir vertikalt datum NN2000 i tillegg til Norsk Transversal Mercator sone 18 (basert på EUREF89)
description: Koordinatsystemet er sammensatt og angir vertikalt datum NN2000 i tillegg til Norsk Transversal Mercator sone 18 (basert på EUREF89)
status: Sendt inn

EUREF89 NTM Sone 7, 2d + NN2000
type: Concept
in scheme: EPSG koder
top concept of: EPSG koder
definition: Koordinatsystemet er sammensatt og angir vertikalt datum NN2000 i tillegg til Norsk Transversal Mercator sone 7 (basert på EUREF89)
description: Koordinatsystemet er sammensatt og angir vertikalt datum NN2000 i tillegg til Norsk Transversal Mercator sone 7 (basert på EUREF89)
status: Sendt inn

EUREF89 UTM sone 32, 2d + NN54
type: Concept
in scheme: EPSG koder
top concept of: EPSG koder
definition: Koordinatsystemet er sammensatt og angir vertikalt datum NN54 i tillegg til UTM sone 32 i EUREF89. Dekker Norges fastland mellom 6°E and 15°E. Berøringsmeridianen er 9° øst for Greenwich.
description: Koordinatsystemet er sammensatt og angir vertikalt datum NN54 i tillegg til UTM sone 32 i EUREF89. Dekker Norges fastland mellom 6°E and 15°E. Berøringsmeridianen er 9° øst for Greenwich.
status: Sendt inn

EUREF89 NTM Sone 29, 2d
type: Concept
in scheme: EPSG koder
top concept of: EPSG koder
definition: Norsk Transversal Mercator sone 29 (basert på EUREF89)
description: Norsk Transversal Mercator sone 29 (basert på EUREF89)
status: Sendt inn

EUREF89 NTM Sone 18, 2d + NN54
type: Concept
in scheme: EPSG koder
top concept of: EPSG koder
definition: Koordinatsystemet er sammensatt og angir vertikalt datum NN54 i tillegg til Norsk Transversal Mercator sone 18 (basert på EUREF89)
description: Koordinatsystemet er sammensatt og angir vertikalt datum NN54 i tillegg til Norsk Transversal Mercator sone 18 (basert på EUREF89)
status: Sendt inn

EUREF89 NTM Sone 12, 2d
type: Concept
in scheme: EPSG koder
top concept of: EPSG koder
definition: Norsk Transversal Mercator sone 12 (basert på EUREF89)
description: Norsk Transversal Mercator sone 12 (basert på EUREF89)
status: Sendt inn

EUREF89 UTM sone 34, 2d + NN2000
type: Concept
in scheme: EPSG koder
top concept of: EPSG koder
definition: Koordinatsystemet er sammensatt og angir vertikalt datum NN2000 i tillegg til UTM sone 34 i EUREF89. Dekker Norges fastland mellom 18°E og 24°E. Berøringsmeridianen er 21° øst for Greenwich.
description: Koordinatsystemet er sammensatt og angir vertikalt datum NN2000 i tillegg til UTM sone 34 i EUREF89. Dekker Norges fastland mellom 18°E og 24°E. Berøringsmeridianen er 21° øst for Greenwich.
status: Sendt inn

EUREF89 NTM Sone 23, 2d + NN54
type: Concept
in scheme: EPSG koder
top concept of: EPSG koder
definition: Koordinatsystemet er sammensatt og angir vertikalt datum NN54 i tillegg til Norsk Transversal Mercator sone 23 (basert på EUREF89)
description: Koordinatsystemet er sammensatt og angir vertikalt datum NN54 i tillegg til Norsk Transversal Mercator sone 23 (basert på EUREF89)
status: Sendt inn

ED 50 UTM Sone 32N, 2D
type: Concept
in scheme: EPSG koder
top concept of: EPSG koder
definition: ED50 / UTM sone 32N er egnet for bruk i Europa - mellom 6 ° Ø og 12 ° Ø. Brukes stort sett i havområder.
description: ED50 / UTM sone 32N er egnet for bruk i Europa - mellom 6 ° Ø og 12 ° Ø. Brukes stort sett i havområder.
status: Sendt inn

EUREF89 NTM Sone 26, 2d
type: Concept
in scheme: EPSG koder
top concept of: EPSG koder
definition: Norsk Transversal Mercator sone 26 (basert på EUREF89)
description: Norsk Transversal Mercator sone 26 (basert på EUREF89)
status: Sendt inn

EUREF89 NTM Sone 19, 2d + NN54
type: Concept
in scheme: EPSG koder
top concept of: EPSG koder
definition: Koordinatsystemet er sammensatt og angir vertikalt datum NN54 i tillegg til Norsk Transversal Mercator sone 19 (basert på EUREF89)
description: Koordinatsystemet er sammensatt og angir vertikalt datum NN54 i tillegg til Norsk Transversal Mercator sone 19 (basert på EUREF89)
status: Sendt inn

EUREF89 NTM Sone 21, 2d + NN2000
type: Concept
in scheme: EPSG koder
top concept of: EPSG koder
definition: Koordinatsystemet er sammensatt og angir vertikalt datum NN2000 i tillegg til Norsk Transversal Mercator sone 21 (basert på EUREF89)
description: Koordinatsystemet er sammensatt og angir vertikalt datum NN2000 i tillegg til Norsk Transversal Mercator sone 21 (basert på EUREF89)
status: Sendt inn

SWEREF99-TM
type: Concept
in scheme: EPSG koder
top concept of: EPSG koder
definition: Det offisiell referansesystemet som benyttes i Sverige idag. SWEREF 99 står for Swedish Reference Frame 1999 og er en realisering av det europeiske systemet ETRS89
description: Det offisiell referansesystemet som benyttes i Sverige idag. SWEREF 99 står for Swedish Reference Frame 1999 og er en realisering av det europeiske systemet ETRS89
status: Sendt inn

EUREF89 NTM Sone 15, 2d + NN54
type: Concept
in scheme: EPSG koder
top concept of: EPSG koder
definition: Koordinatsystemet er sammensatt og angir vertikalt datum NN54 i tillegg til Norsk Transversal Mercator sone 15 (basert på EUREF89)
description: Koordinatsystemet er sammensatt og angir vertikalt datum NN54 i tillegg til Norsk Transversal Mercator sone 15 (basert på EUREF89)
status: Sendt inn

EUREF89 NTM Sone 17, 2d
type: Concept
in scheme: EPSG koder
top concept of: EPSG koder
definition: Norsk Transversal Mercator sone 17 (basert på EUREF89)
description: Norsk Transversal Mercator sone 17 (basert på EUREF89)
status: Sendt inn

Ikke relevant
type: Concept
in scheme: EPSG koder
top concept of: EPSG koder
definition: Fiktiv EPSG-kode som benyttes der det ikke er relevant med en reell kode.
description: Fiktiv EPSG-kode som benyttes der det ikke er relevant med en reell kode.
status: Gyldig

EUREF89 NTM Sone 6, 2d
type: Concept
in scheme: EPSG koder
top concept of: EPSG koder
definition: Norsk Transversal Mercator sone 6 (basert på EUREF89)
description: Norsk Transversal Mercator sone 6 (basert på EUREF89)
status: Sendt inn

EUREF89 NTM Sone 26, 2d + NN54
type: Concept
in scheme: EPSG koder
top concept of: EPSG koder
definition: Koordinatsystemet er sammensatt og angir vertikalt datum NN54 i tillegg til Norsk Transversal Mercator sone 26 (basert på EUREF89)
description: Koordinatsystemet er sammensatt og angir vertikalt datum NN54 i tillegg til Norsk Transversal Mercator sone 26 (basert på EUREF89)
status: Sendt inn

EUREF89 NTM Sone 8, 2d + NN2000
type: Concept
in scheme: EPSG koder
top concept of: EPSG koder
definition: Koordinatsystemet er sammensatt og angir vertikalt datum NN2000 i tillegg til Norsk Transversal Mercator sone 8 (basert på EUREF89)
description: Koordinatsystemet er sammensatt og angir vertikalt datum NN2000 i tillegg til Norsk Transversal Mercator sone 8 (basert på EUREF89)
status: Sendt inn

EUREF89 NTM Sone 20, 2d + NN2000
type: Concept
in scheme: EPSG koder
top concept of: EPSG koder
definition: Koordinatsystemet er sammensatt og angir vertikalt datum NN2000 i tillegg til Norsk Transversal Mercator sone 20 (basert på EUREF89)
description: Koordinatsystemet er sammensatt og angir vertikalt datum NN2000 i tillegg til Norsk Transversal Mercator sone 20 (basert på EUREF89)
status: Sendt inn

North Pole LAEA Bering Sea, basert på WGS84
type: Concept
in scheme: EPSG koder
top concept of: EPSG koder
definition: Arealriktig planprojeksjon. Passer for den nordlige halvkule nord for 45°N, inkludert Arktis. Orientert mot Beringhavet.
description: Arealriktig planprojeksjon. Passer for den nordlige halvkule nord for 45°N, inkludert Arktis. Orientert mot Beringhavet.
status: Sendt inn

EUREF89 NTM Sone 30, 2d + NN54
type: Concept
in scheme: EPSG koder
top concept of: EPSG koder
definition: Koordinatsystemet er sammensatt og angir vertikalt datum NN54 i tillegg til Norsk Transversal Mercator sone 30 (basert på EUREF89)
description: Koordinatsystemet er sammensatt og angir vertikalt datum NN54 i tillegg til Norsk Transversal Mercator sone 30 (basert på EUREF89)
status: Sendt inn

EUREF89 NTM Sone 27, 2d
type: Concept
in scheme: EPSG koder
top concept of: EPSG koder
definition: Norsk Transversal Mercator sone 27 (basert på EUREF89)
description: Norsk Transversal Mercator sone 27 (basert på EUREF89)
status: Sendt inn

EUREF89 NTM Sone 10, 2d + NN2000
type: Concept
in scheme: EPSG koder
top concept of: EPSG koder
definition: Koordinatsystemet er sammensatt og angir vertikalt datum NN2000 i tillegg til Norsk Transversal Mercator sone 10 (basert på EUREF89)
description: Koordinatsystemet er sammensatt og angir vertikalt datum NN2000 i tillegg til Norsk Transversal Mercator sone 10 (basert på EUREF89)
status: Sendt inn

EUREF89 NTM Sone 12, 2d + NN54
type: Concept
in scheme: EPSG koder
top concept of: EPSG koder
definition: Koordinatsystemet er sammensatt og angir vertikalt datum NN54 i tillegg til Norsk Transversal Mercator sone 12 (basert på EUREF89)
description: Koordinatsystemet er sammensatt og angir vertikalt datum NN54 i tillegg til Norsk Transversal Mercator sone 12 (basert på EUREF89)
status: Sendt inn

EUREF89 NTM Sone 11, 2d + NN54
type: Concept
in scheme: EPSG koder
top concept of: EPSG koder
definition: Koordinatsystemet er sammensatt og angir vertikalt datum NN54 i tillegg til Norsk Transversal Mercator sone 11 (basert på EUREF89)
description: Koordinatsystemet er sammensatt og angir vertikalt datum NN54 i tillegg til Norsk Transversal Mercator sone 11 (basert på EUREF89)
status: Sendt inn

EUREF89 Geografisk + NN54
type: Concept
in scheme: EPSG koder
top concept of: EPSG koder
definition: Geodetisk koordinatsystem i 3 dimensjoner uten projeksjon
description: Geodetisk koordinatsystem i 3 dimensjoner uten projeksjon
status: Sendt inn

EUREF89 UTM sone 31, 2d
type: Concept
in scheme: EPSG koder
top concept of: EPSG koder
definition: UTM er en Gauss-Krüger projeksjon med 6° sonebredde. Berøringsmeridianen er 3° øst for Greenwich.
description: UTM er en Gauss-Krüger projeksjon med 6° sonebredde. Berøringsmeridianen er 3° øst for Greenwich.
status: Sendt inn

EUREF89 NTM Sone 14, 2d + NN54
type: Concept
in scheme: EPSG koder
top concept of: EPSG koder
definition: Koordinatsystemet er sammensatt og angir vertikalt datum NN54 i tillegg til Norsk Transversal Mercator sone 14 (basert på EUREF89)
description: Koordinatsystemet er sammensatt og angir vertikalt datum NN54 i tillegg til Norsk Transversal Mercator sone 14 (basert på EUREF89)
status: Sendt inn

EUREF89 NTM Sone 23, 2d + NN2000
type: Concept
in scheme: EPSG koder
top concept of: EPSG koder
definition: Koordinatsystemet er sammensatt og angir vertikalt datum NN2000 i tillegg til Norsk Transversal Mercator sone 23 (basert på EUREF89)
description: Koordinatsystemet er sammensatt og angir vertikalt datum NN2000 i tillegg til Norsk Transversal Mercator sone 23 (basert på EUREF89)
status: Sendt inn

EUREF89 NTM Sone 20, 2d + NN54
type: Concept
in scheme: EPSG koder
top concept of: EPSG koder
definition: Koordinatsystemet er sammensatt og angir vertikalt datum NN54 i tillegg til Norsk Transversal Mercator sone 20 (basert på EUREF89)
description: Koordinatsystemet er sammensatt og angir vertikalt datum NN54 i tillegg til Norsk Transversal Mercator sone 20 (basert på EUREF89)
status: Sendt inn

EUREF89 NTM Sone 22, 2d + NN54
type: Concept
in scheme: EPSG koder
top concept of: EPSG koder
definition: Koordinatsystemet er sammensatt og angir vertikalt datum NN54 i tillegg til Norsk Transversal Mercator sone 22 (basert på EUREF89)
description: Koordinatsystemet er sammensatt og angir vertikalt datum NN54 i tillegg til Norsk Transversal Mercator sone 22 (basert på EUREF89)
status: Sendt inn

WGS84 Geografisk
type: Concept
in scheme: EPSG koder
top concept of: EPSG koder
definition: World Geodetic System 1984. Brukt av GPS satellittnavigasjonssystemer. Uprojisert.
description: World Geodetic System 1984. Brukt av GPS satellittnavigasjonssystemer. Uprojisert.
status: Sendt inn

WGS84 UTM sone 35, 2d
type: Concept
in scheme: EPSG koder
top concept of: EPSG koder
definition: UTM er en Gauss-Krüger projeksjon med 6° sonebredde. Berøringsmeridianen er 27° øst for Greenwich.
description: UTM er en Gauss-Krüger projeksjon med 6° sonebredde. Berøringsmeridianen er 27° øst for Greenwich.
status: Gyldig

EUREF89 NTM Sone 11, 2d + NN2000
type: Concept
in scheme: EPSG koder
top concept of: EPSG koder
definition: Koordinatsystemet er sammensatt og angir vertikalt datum NN2000 i tillegg til Norsk Transversal Mercator sone 11 (basert på EUREF89)
description: Koordinatsystemet er sammensatt og angir vertikalt datum NN2000 i tillegg til Norsk Transversal Mercator sone 11 (basert på EUREF89)
status: Sendt inn

EUREF89 NTM Sone 24, 2d
type: Concept
in scheme: EPSG koder
top concept of: EPSG koder
definition: Norsk Transversal Mercator sone 24 (basert på EUREF89)
description: Norsk Transversal Mercator sone 24 (basert på EUREF89)
status: Sendt inn

North Pole LAEA Atlantic, basert på WGS84
type: Concept
in scheme: EPSG koder
top concept of: EPSG koder
definition: Arealriktig planprojeksjon. Passer for den nordlige halvkule nord for 45°N, inkludert Arktis. Orientert mot Atlanterhavet.
description: Arealriktig planprojeksjon. Passer for den nordlige halvkule nord for 45°N, inkludert Arktis. Orientert mot Atlanterhavet.
status: Sendt inn

EUREF89 NTM Sone 15, 2d + NN2000
type: Concept
in scheme: EPSG koder
top concept of: EPSG koder
definition: Koordinatsystemet er sammensatt og angir vertikalt datum NN2000 i tillegg til Norsk Transversal Mercator sone 15 (basert på EUREF89)
description: Koordinatsystemet er sammensatt og angir vertikalt datum NN2000 i tillegg til Norsk Transversal Mercator sone 15 (basert på EUREF89)
status: Sendt inn

EUREF89 NTM Sone 6, 2d + NN2000
type: Concept
in scheme: EPSG koder
top concept of: EPSG koder
definition: Koordinatsystemet er sammensatt og angir vertikalt datum NN2000 i tillegg til Norsk Transversal Mercator sone 6 (basert på EUREF89)
description: Koordinatsystemet er sammensatt og angir vertikalt datum NN2000 i tillegg til Norsk Transversal Mercator sone 6 (basert på EUREF89)
status: Sendt inn

EUREF89 NTM Sone 25, 2d + NN54
type: Concept
in scheme: EPSG koder
top concept of: EPSG koder
definition: Koordinatsystemet er sammensatt og angir vertikalt datum NN54 i tillegg til Norsk Transversal Mercator sone 25 (basert på EUREF89)
description: Koordinatsystemet er sammensatt og angir vertikalt datum NN54 i tillegg til Norsk Transversal Mercator sone 25 (basert på EUREF89)
status: Sendt inn

EUREF89 NTM Sone 27, 2d + NN54
type: Concept
in scheme: EPSG koder
top concept of: EPSG koder
definition: Koordinatsystemet er sammensatt og angir vertikalt datum NN54 i tillegg til Norsk Transversal Mercator sone 27 (basert på EUREF89)
description: Koordinatsystemet er sammensatt og angir vertikalt datum NN54 i tillegg til Norsk Transversal Mercator sone 27 (basert på EUREF89)
status: Sendt inn

EUREF89 NTM Sone 18, 2d
type: Concept
in scheme: EPSG koder
top concept of: EPSG koder
definition: Norsk Transversal Mercator sone 18 (basert på EUREF89)
description: Norsk Transversal Mercator sone 18 (basert på EUREF89)
status: Sendt inn

EUREF89 NTM Sone 16, 2d
type: Concept
in scheme: EPSG koder
top concept of: EPSG koder
definition: Norsk Transversal Mercator sone 16 (basert på EUREF89)
description: Norsk Transversal Mercator sone 16 (basert på EUREF89)
status: Sendt inn

EUREF89 NTM Sone 26, 2d + NN2000
type: Concept
in scheme: EPSG koder
top concept of: EPSG koder
definition: Koordinatsystemet er sammensatt og angir vertikalt datum NN2000 i tillegg til Norsk Transversal Mercator sone 26 (basert på EUREF89)
description: Koordinatsystemet er sammensatt og angir vertikalt datum NN2000 i tillegg til Norsk Transversal Mercator sone 26 (basert på EUREF89)
status: Sendt inn

EUREF89 NTM Sone 22, 2d
type: Concept
in scheme: EPSG koder
top concept of: EPSG koder
definition: Norsk Transversal Mercator sone 22 (basert på EUREF89)
description: Norsk Transversal Mercator sone 22 (basert på EUREF89)
status: Sendt inn

NN2000 høyde
type: Concept
in scheme: EPSG koder
top concept of: EPSG koder
definition: Vertikalt koordinatsystem basert på datumet Norge Normal Null 2000
description: Vertikalt koordinatsystem basert på datumet Norge Normal Null 2000
status: Sendt inn

EUREF89 Geografisk + NN2000
type: Concept
in scheme: EPSG koder
top concept of: EPSG koder
definition: Geodetisk koordinatsystem i 3 dimensjoner uten projeksjon
description: Geodetisk koordinatsystem i 3 dimensjoner uten projeksjon
status: Sendt inn

EGM2008 høyde
type: Concept
in scheme: EPSG koder
top concept of: EPSG koder
definition: Earth Gravitational Model 2008 er en sfærisk harmonisk modell av jordens gravitasjonspotensial
description: Earth Gravitational Model 2008 er en sfærisk harmonisk modell av jordens gravitasjonspotensial
status: Gyldig

EUREF89 NTM Sone 14, 2d + NN2000
type: Concept
in scheme: EPSG koder
top concept of: EPSG koder
definition: Koordinatsystemet er sammensatt og angir vertikalt datum NN2000 i tillegg til Norsk Transversal Mercator sone 14 (basert på EUREF89)
description: Koordinatsystemet er sammensatt og angir vertikalt datum NN2000 i tillegg til Norsk Transversal Mercator sone 14 (basert på EUREF89)
status: Sendt inn

EUREF89 NTM Sone 16, 2d + NN54
type: Concept
in scheme: EPSG koder
top concept of: EPSG koder
definition: Koordinatsystemet er sammensatt og angir vertikalt datum NN54 i tillegg til Norsk Transversal Mercator sone 16 (basert på EUREF89)
description: Koordinatsystemet er sammensatt og angir vertikalt datum NN54 i tillegg til Norsk Transversal Mercator sone 16 (basert på EUREF89)
status: Sendt inn

EUREF89 UTM sone 34, 2d + NN54
type: Concept
in scheme: EPSG koder
top concept of: EPSG koder
definition: Koordinatsystemet er sammensatt og angir vertikalt datum NN54 i tillegg til UTM sone 34 i EUREF89. Dekker Norges fastland mellom 18°E og 24°E. Berøringsmeridianen er 21° øst for Greenwich.
description: Koordinatsystemet er sammensatt og angir vertikalt datum NN54 i tillegg til UTM sone 34 i EUREF89. Dekker Norges fastland mellom 18°E og 24°E. Berøringsmeridianen er 21° øst for Greenwich.
status: Sendt inn

EUREF89 NTM Sone 6, 2d + NN54
type: Concept
in scheme: EPSG koder
top concept of: EPSG koder
definition: Koordinatsystemet er sammensatt og angir vertikalt datum NN54 i tillegg til Norsk Transversal Mercator sone 6 (basert på EUREF89)
description: Koordinatsystemet er sammensatt og angir vertikalt datum NN54 i tillegg til Norsk Transversal Mercator sone 6 (basert på EUREF89)
status: Sendt inn

EUREF89 NTM Sone 27, 2d + NN2000
type: Concept
in scheme: EPSG koder
top concept of: EPSG koder
definition: Koordinatsystemet er sammensatt og angir vertikalt datum NN2000 i tillegg til Norsk Transversal Mercator sone 27 (basert på EUREF89)
description: Koordinatsystemet er sammensatt og angir vertikalt datum NN2000 i tillegg til Norsk Transversal Mercator sone 27 (basert på EUREF89)
status: Sendt inn

EUREF89 NTM Sone 8, 2d + NN54
type: Concept
in scheme: EPSG koder
top concept of: EPSG koder
definition: Koordinatsystemet er sammensatt og angir vertikalt datum NN54 i tillegg til Norsk Transversal Mercator sone 8 (basert på EUREF89)
description: Koordinatsystemet er sammensatt og angir vertikalt datum NN54 i tillegg til Norsk Transversal Mercator sone 8 (basert på EUREF89)
status: Sendt inn

EUREF89 UTM sone 31, 2d + NN2000
type: Concept
in scheme: EPSG koder
top concept of: EPSG koder
definition: Koordinatsystemet er sammensatt og angir vertikalt datum NN2000 i tillegg til UTM sone 31 i EUREF89. Dekker Norges fastland mellom 0° og 18°E. Berøringsmeridianen er 3° øst for Greenwich.
description: Koordinatsystemet er sammensatt og angir vertikalt datum NN2000 i tillegg til UTM sone 31 i EUREF89. Dekker Norges fastland mellom 0° og 18°E. Berøringsmeridianen er 3° øst for Greenwich.
status: Sendt inn

EUREF89 UTM sone 35, 2d + NN2000
type: Concept
in scheme: EPSG koder
top concept of: EPSG koder
definition: Koordinatsystemet er sammensatt og angir vertikalt datum NN2000 i tillegg til UTM sone 35 i EUREF89. Dekker Norges fastland mellom 24°E og 30°E. Berøringsmeridianen er 27° øst for Greenwich.
description: Koordinatsystemet er sammensatt og angir vertikalt datum NN2000 i tillegg til UTM sone 35 i EUREF89. Dekker Norges fastland mellom 24°E og 30°E. Berøringsmeridianen er 27° øst for Greenwich.
status: Sendt inn

EUREF89 NTM Sone 7, 2d + NN54
type: Concept
in scheme: EPSG koder
top concept of: EPSG koder
definition: Koordinatsystemet er sammensatt og angir vertikalt datum NN54 i tillegg til Norsk Transversal Mercator sone 7 (basert på EUREF89)
description: Koordinatsystemet er sammensatt og angir vertikalt datum NN54 i tillegg til Norsk Transversal Mercator sone 7 (basert på EUREF89)
status: Sendt inn

EUREF89 NTM Sone 19, 2d
type: Concept
in scheme: EPSG koder
top concept of: EPSG koder
definition: Norsk Transversal Mercator sone 19 (basert på EUREF89)
description: Norsk Transversal Mercator sone 19 (basert på EUREF89)
status: Sendt inn

EUREF89 NTM Sone 13, 2d + NN54
type: Concept
in scheme: EPSG koder
top concept of: EPSG koder
definition: Koordinatsystemet er sammensatt og angir vertikalt datum NN54 i tillegg til Norsk Transversal Mercator sone 13 (basert på EUREF89)
description: Koordinatsystemet er sammensatt og angir vertikalt datum NN54 i tillegg til Norsk Transversal Mercator sone 13 (basert på EUREF89)
status: Sendt inn

EUREF89 NTM Sone 10, 2d
type: Concept
in scheme: EPSG koder
top concept of: EPSG koder
definition: Norsk Transversal Mercator sone 10 (basert på EUREF89)
description: Norsk Transversal Mercator sone 10 (basert på EUREF89)
status: Sendt inn

EUREF89 NTM Sone 30, 2d
type: Concept
in scheme: EPSG koder
top concept of: EPSG koder
definition: Norsk Transversal Mercator sone 30 (basert på EUREF89)
description: Norsk Transversal Mercator sone 30 (basert på EUREF89)
status: Sendt inn

EUREF89 NTM Sone 8, 2d
type: Concept
in scheme: EPSG koder
top concept of: EPSG koder
definition: Norsk Transversal Mercator sone 8 (basert på EUREF89)
description: Norsk Transversal Mercator sone 8 (basert på EUREF89)
status: Sendt inn

EUREF89 NTM Sone 28, 2d + NN54
type: Concept
in scheme: EPSG koder
top concept of: EPSG koder
definition: Koordinatsystemet er sammensatt og angir vertikalt datum NN54 i tillegg til Norsk Transversal Mercator sone 28 (basert på EUREF89)
description: Koordinatsystemet er sammensatt og angir vertikalt datum NN54 i tillegg til Norsk Transversal Mercator sone 28 (basert på EUREF89)
status: Sendt inn

EUREF89 NTM Sone 5, 2d + NN2000
type: Concept
in scheme: EPSG koder
top concept of: EPSG koder
definition: Koordinatsystemet er sammensatt og angir vertikalt datum NN2000 i tillegg til Norsk Transversal Mercator sone 5 (basert på EUREF89)
description: Koordinatsystemet er sammensatt og angir vertikalt datum NN2000 i tillegg til Norsk Transversal Mercator sone 5 (basert på EUREF89)
status: Sendt inn

EUREF89 NTM Sone 20, 2d
type: Concept
in scheme: EPSG koder
top concept of: EPSG koder
definition: Norsk Transversal Mercator sone 20 (basert på EUREF89)
description: Norsk Transversal Mercator sone 20 (basert på EUREF89)
status: Sendt inn

EUREF89 NTM Sone 28, 2d
type: Concept
in scheme: EPSG koder
top concept of: EPSG koder
definition: Norsk Transversal Mercator sone 28 (basert på EUREF89)
description: Norsk Transversal Mercator sone 28 (basert på EUREF89)
status: Sendt inn

EUREF89 / ETRS89-LAEA Europe
type: Concept
in scheme: EPSG koder
top concept of: EPSG koder
definition: Lambert Azimuthal Equal Area er et koordinatsystem for hele Europa for alle målestokker. Arealriktig planprojeksjon brukt blant annet for statistiske kartvisnsning i alle målestokker hvor arealriktig (flateriktig) kartpresentasjon er påkrevd
description: Lambert Azimuthal Equal Area er et koordinatsystem for hele Europa for alle målestokker. Arealriktig planprojeksjon brukt blant annet for statistiske kartvisnsning i alle målestokker hvor arealriktig (flateriktig) kartpresentasjon er påkrevd
status: Sendt inn

EUREF89 NTM Sone 16, 2d + NN2000
type: Concept
in scheme: EPSG koder
top concept of: EPSG koder
definition: Koordinatsystemet er sammensatt og angir vertikalt datum NN2000 i tillegg til Norsk Transversal Mercator sone 16 (basert på EUREF89)
description: Koordinatsystemet er sammensatt og angir vertikalt datum NN2000 i tillegg til Norsk Transversal Mercator sone 16 (basert på EUREF89)
status: Sendt inn

EUREF89 NTM Sone 9, 2d + NN54
type: Concept
in scheme: EPSG koder
top concept of: EPSG koder
definition: Koordinatsystemet er sammensatt og angir vertikalt datum NN54 i tillegg til Norsk Transversal Mercator sone 9 (basert på EUREF89)
description: Koordinatsystemet er sammensatt og angir vertikalt datum NN54 i tillegg til Norsk Transversal Mercator sone 9 (basert på EUREF89)
status: Sendt inn

EUREF89 NTM Sone 13, 2d
type: Concept
in scheme: EPSG koder
top concept of: EPSG koder
definition: Norsk Transversal Mercator sone 13 (basert på EUREF89)
description: Norsk Transversal Mercator sone 13 (basert på EUREF89)
status: Sendt inn

EUREF89 UTM sone 32, 2d + NN2000
type: Concept
in scheme: EPSG koder
top concept of: EPSG koder
definition: Koordinatsystemet er sammensatt og angir vertikalt datum NN2000 i tillegg til UTM sone 32 i EUREF89. Dekker Norges fastland mellom 6°E and 15°E. Berøringsmeridianen er 9° øst for Greenwich.
description: Koordinatsystemet er sammensatt og angir vertikalt datum NN2000 i tillegg til UTM sone 32 i EUREF89. Dekker Norges fastland mellom 6°E and 15°E. Berøringsmeridianen er 9° øst for Greenwich.
status: Sendt inn

WGS84 UTM sone 33, 2d
type: Concept
in scheme: EPSG koder
top concept of: EPSG koder
definition: UTM er en Gauss-Krüger projeksjon med 6° sonebredde. Berøringsmeridianen er 15° øst for Greenwich.
description: UTM er en Gauss-Krüger projeksjon med 6° sonebredde. Berøringsmeridianen er 15° øst for Greenwich.
status: Sendt inn

EUREF89 NTM Sone 29, 2d + NN2000
type: Concept
in scheme: EPSG koder
top concept of: EPSG koder
definition: Koordinatsystemet er sammensatt og angir vertikalt datum NN2000 i tillegg til Norsk Transversal Mercator sone 29 (basert på EUREF89)
description: Koordinatsystemet er sammensatt og angir vertikalt datum NN2000 i tillegg til Norsk Transversal Mercator sone 29 (basert på EUREF89)
status: Sendt inn

EUREF89 UTM sone 31, 2d + NN54
type: Concept
in scheme: EPSG koder
top concept of: EPSG koder
definition: Koordinatsystemet er sammensatt og angir vertikalt datum NN54 i tillegg til UTM sone 31 i EUREF89. Dekker Norges fastland mellom 0° og 6°E. Berøringsmeridianen er 3° øst for Greenwich.
description: Koordinatsystemet er sammensatt og angir vertikalt datum NN54 i tillegg til UTM sone 31 i EUREF89. Dekker Norges fastland mellom 0° og 6°E. Berøringsmeridianen er 3° øst for Greenwich.
status: Sendt inn

North Pole LAEA Alaska, basert på WGS84
type: Concept
in scheme: EPSG koder
top concept of: EPSG koder
definition: Arealriktig planprojeksjon. Passer for den nordlige halvkule nord for 45°N, inkludert Arktis. Orientert mot Alaska.
description: Arealriktig planprojeksjon. Passer for den nordlige halvkule nord for 45°N, inkludert Arktis. Orientert mot Alaska.
status: Sendt inn

EUREF 89 Geografisk + EGM2008 høyde
type: Concept
in scheme: EPSG koder
top concept of: EPSG koder
definition: Koordinatsystemet er sammensatt og angir vertikalt datum EUREF 89 Geografisk (ETRS 89) 2d i tillegg til EGM2008 høyde. Det vil komme en offisiell kode etter hvert.
description: Koordinatsystemet er sammensatt og angir vertikalt datum EUREF 89 Geografisk (ETRS 89) 2d i tillegg til EGM2008 høyde. Det vil komme en offisiell kode etter hvert.
status: Gyldig

EUREF89 NTM Sone 23, 2d
type: Concept
in scheme: EPSG koder
top concept of: EPSG koder
definition: Norsk Transversal Mercator sone 23 (basert på EUREF89)
description: Norsk Transversal Mercator sone 23 (basert på EUREF89)
status: Sendt inn

EUREF89 NTM Sone 10, 2d + NN54
type: Concept
in scheme: EPSG koder
top concept of: EPSG koder
definition: Koordinatsystemet er sammensatt og angir vertikalt datum NN54 i tillegg til Norsk Transversal Mercator sone 10 (basert på EUREF89)
description: Koordinatsystemet er sammensatt og angir vertikalt datum NN54 i tillegg til Norsk Transversal Mercator sone 10 (basert på EUREF89)
status: Sendt inn

EUREF89 NTM Sone 9, 2d + NN2000
type: Concept
in scheme: EPSG koder
top concept of: EPSG koder
definition: Koordinatsystemet er sammensatt og angir vertikalt datum NN2000 i tillegg til Norsk Transversal Mercator sone 9 (basert på EUREF89)
description: Koordinatsystemet er sammensatt og angir vertikalt datum NN2000 i tillegg til Norsk Transversal Mercator sone 9 (basert på EUREF89)
status: Sendt inn

EUREF89 NTM Sone 17, 2d + NN2000
type: Concept
in scheme: EPSG koder
top concept of: EPSG koder
definition: Koordinatsystemet er sammensatt og angir vertikalt datum NN2000 i tillegg til Norsk Transversal Mercator sone 17 (basert på EUREF89)
description: Koordinatsystemet er sammensatt og angir vertikalt datum NN2000 i tillegg til Norsk Transversal Mercator sone 17 (basert på EUREF89)
status: Sendt inn

EUREF89 / ETRS89-LCC Europe
type: Concept
in scheme: EPSG koder
top concept of: EPSG koder
definition: Lambert Conformal Conic er et koordinatsystem for hele Europa for små målestokker. Formriktig kjegleprojeksjon som benyttes for målestokken 1:500,000 og mindre. Sentralmeridian 10° grader øst for Greenwich.
description: Lambert Conformal Conic er et koordinatsystem for hele Europa for små målestokker. Formriktig kjegleprojeksjon som benyttes for målestokken 1:500,000 og mindre. Sentralmeridian 10° grader øst for Greenwich.
status: Sendt inn

EUREF89 UTM sone 36, 2d
type: Concept
in scheme: EPSG koder
top concept of: EPSG koder
definition: UTM er en Gauss-Krüger projeksjon med 6° sonebredde. Berøringsmeridianen er 33° øst for Greenwich.
description: UTM er en Gauss-Krüger projeksjon med 6° sonebredde. Berøringsmeridianen er 33° øst for Greenwich.
status: Sendt inn

EUREF89 NTM Sone 12, 2d + NN2000
type: Concept
in scheme: EPSG koder
top concept of: EPSG koder
definition: Koordinatsystemet er sammensatt og angir vertikalt datum NN2000 i tillegg til Norsk Transversal Mercator sone 12 (basert på EUREF89)
description: Koordinatsystemet er sammensatt og angir vertikalt datum NN2000 i tillegg til Norsk Transversal Mercator sone 12 (basert på EUREF89)
status: Sendt inn

Web Mercator / Pseudo-Mercator
type: Concept
in scheme: EPSG koder
top concept of: EPSG koder
definition: Spherical Mercator. Mye brukt projeksjon for webkart, blant annet for Google-maps, OpenStreetMap, Bing, ArcGIS, ESRI. Blir også kalt "Web Mercator" eller "Google Web Mercator". I tidligere bruk benyttet en EPSG:900913. Dette henger fremdeles igjen i en del løsninger.
description: Spherical Mercator. Mye brukt projeksjon for webkart, blant annet for Google-maps, OpenStreetMap, Bing, ArcGIS, ESRI. Blir også kalt "Web Mercator" eller "Google Web Mercator". I tidligere bruk benyttet en EPSG:900913. Dette henger fremdeles igjen i en del løsninger.
status: Sendt inn

EUREF89 UTM sone 30, 2d
type: Concept
in scheme: EPSG koder
top concept of: EPSG koder
definition: UTM er en Gauss-Krüger projeksjon med 6° sonebredde. Berøringsmeridianen er 3° vest for Greenwich.
description: UTM er en Gauss-Krüger projeksjon med 6° sonebredde. Berøringsmeridianen er 3° vest for Greenwich.
status: Gyldig

EUREF89 NTM Sone 29, 2d + NN54
type: Concept
in scheme: EPSG koder
top concept of: EPSG koder
definition: Koordinatsystemet er sammensatt og angir vertikalt datum NN54 i tillegg til Norsk Transversal Mercator sone 29 (basert på EUREF89)
description: Koordinatsystemet er sammensatt og angir vertikalt datum NN54 i tillegg til Norsk Transversal Mercator sone 29 (basert på EUREF89)
status: Sendt inn

EUREF89 NTM Sone 5, 2d + NN54
type: Concept
in scheme: EPSG koder
top concept of: EPSG koder
definition: Koordinatsystemet er sammensatt og angir vertikalt datum NN54 i tillegg til Norsk Transversal Mercator sone 5 (basert på EUREF89)
description: Koordinatsystemet er sammensatt og angir vertikalt datum NN54 i tillegg til Norsk Transversal Mercator sone 5 (basert på EUREF89)
status: Sendt inn

EUREF89 NTM Sone 22, 2d + NN2000
type: Concept
in scheme: EPSG koder
top concept of: EPSG koder
definition: Koordinatsystemet er sammensatt og angir vertikalt datum NN2000 i tillegg til Norsk Transversal Mercator sone 22 (basert på EUREF89)
description: Koordinatsystemet er sammensatt og angir vertikalt datum NN2000 i tillegg til Norsk Transversal Mercator sone 22 (basert på EUREF89)
status: Sendt inn

EUREF89 NTM Sone 25, 2d + NN2000
type: Concept
in scheme: EPSG koder
top concept of: EPSG koder
definition: Koordinatsystemet er sammensatt og angir vertikalt datum NN2000 i tillegg til Norsk Transversal Mercator sone 25 (basert på EUREF89)
description: Koordinatsystemet er sammensatt og angir vertikalt datum NN2000 i tillegg til Norsk Transversal Mercator sone 25 (basert på EUREF89)
status: Sendt inn

EUREF89 Geografisk, 2d + ellipsoide
type: Concept
in scheme: EPSG koder
top concept of: EPSG koder
status: Sendt inn

EUREF89 UTM sone 33, 2d
type: Concept
in scheme: EPSG koder
top concept of: EPSG koder
definition: UTM er en Gauss-Krüger projeksjon med 6° sonebredde. Berøringsmeridianen er 15° øst for Greenwich.
description: UTM er en Gauss-Krüger projeksjon med 6° sonebredde. Berøringsmeridianen er 15° øst for Greenwich.
status: Sendt inn

EUREF89 NTM Sone 14, 2d
type: Concept
in scheme: EPSG koder
top concept of: EPSG koder
definition: Norsk Transversal Mercator sone 14 (basert på EUREF89)
description: Norsk Transversal Mercator sone 14 (basert på EUREF89)
status: Sendt inn

ED50 Geografisk
type: Concept
in scheme: EPSG koder
top concept of: EPSG koder
definition: European Datum 1950. Geodetisk koordinatsystem i 2 dimensjoner uten projeksjon. Brukes stort sett i havområder.
description: European Datum 1950. Geodetisk koordinatsystem i 2 dimensjoner uten projeksjon. Brukes stort sett i havområder.
status: Sendt inn

EUREF89 UTM sone 33, 2d + NN2000
type: Concept
in scheme: EPSG koder
top concept of: EPSG koder
definition: Koordinatsystemet er sammensatt og angir vertikalt datum NN2000 i tillegg til UTM sone 33 i EUREF89. Dekker Norges fastland mellom 12°E og 18°E. Berøringsmeridianen er 15° øst for Greenwich.
description: Koordinatsystemet er sammensatt og angir vertikalt datum NN2000 i tillegg til UTM sone 33 i EUREF89. Dekker Norges fastland mellom 12°E og 18°E. Berøringsmeridianen er 15° øst for Greenwich.
status: Sendt inn

NN54 høyde
type: Concept
in scheme: EPSG koder
top concept of: EPSG koder
definition: Vertkalt koordinatsystem basert på vertikalt datum Norge Normal Null 1954
description: Vertkalt koordinatsystem basert på vertikalt datum Norge Normal Null 1954
status: Sendt inn

EUREF89 NTM Sone 28, 2d + NN2000
type: Concept
in scheme: EPSG koder
top concept of: EPSG koder
definition: Koordinatsystemet er sammensatt og angir vertikalt datum NN2000 i tillegg til Norsk Transversal Mercator sone 28 (basert på EUREF89)
description: Koordinatsystemet er sammensatt og angir vertikalt datum NN2000 i tillegg til Norsk Transversal Mercator sone 28 (basert på EUREF89)
status: Sendt inn

EUREF89 NTM Sone 15, 2d
type: Concept
in scheme: EPSG koder
top concept of: EPSG koder
definition: Norsk Transversal Mercator sone 15 (basert på EUREF89)
description: Norsk Transversal Mercator sone 15 (basert på EUREF89)
status: Sendt inn

EUREF89 NTM Sone 24, 2d + NN2000
type: Concept
in scheme: EPSG koder
top concept of: EPSG koder
definition: Koordinatsystemet er sammensatt og angir vertikalt datum NN2000 i tillegg til Norsk Transversal Mercator sone 24 (basert på EUREF89)
description: Koordinatsystemet er sammensatt og angir vertikalt datum NN2000 i tillegg til Norsk Transversal Mercator sone 24 (basert på EUREF89)
status: Sendt inn

WGS84 UTM sone 32, 2d
type: Concept
in scheme: EPSG koder
top concept of: EPSG koder
definition: UTM er en Gauss-Krüger projeksjon med 6° sonebredde. Berøringsmeridianen er 9° øst for Greenwich.
description: UTM er en Gauss-Krüger projeksjon med 6° sonebredde. Berøringsmeridianen er 9° øst for Greenwich.
status: Gyldig

EUREF89 UTM sone 35, 2d + NN54
type: Concept
in scheme: EPSG koder
top concept of: EPSG koder
definition: Koordinatsystemet er sammensatt og angir vertikalt datum NN54 i tillegg til UTM sone 35 i EUREF89. Dekker Norges fastland mellom 24°E og 30°E. Berøringsmeridianen er 27° øst for Greenwich.
description: Koordinatsystemet er sammensatt og angir vertikalt datum NN54 i tillegg til UTM sone 35 i EUREF89. Dekker Norges fastland mellom 24°E og 30°E. Berøringsmeridianen er 27° øst for Greenwich.
status: Sendt inn

EUREF89 NTM Sone 19, 2d + NN2000
type: Concept
in scheme: EPSG koder
top concept of: EPSG koder
definition: Koordinatsystemet er sammensatt og angir vertikalt datum NN2000 i tillegg til Norsk Transversal Mercator sone 19 (basert på EUREF89)
description: Koordinatsystemet er sammensatt og angir vertikalt datum NN2000 i tillegg til Norsk Transversal Mercator sone 19 (basert på EUREF89)
status: Sendt inn

EUREF89 NTM Sone 13 2d + NN2000
type: Concept
in scheme: EPSG koder
top concept of: EPSG koder
definition: Koordinatsystemet er sammensatt og angir vertikalt datum NN2000 i tillegg til Norsk Transversal Mercator sone 13 (basert på EUREF89)
description: Koordinatsystemet er sammensatt og angir vertikalt datum NN2000 i tillegg til Norsk Transversal Mercator sone 13 (basert på EUREF89)
status: Sendt inn

EUREF89 NTM Sone 7, 2d
type: Concept
in scheme: EPSG koder
top concept of: EPSG koder
definition: Norsk Transversal Mercator sone 7 (basert på EUREF89)
description: Norsk Transversal Mercator sone 7 (basert på EUREF89)
status: Sendt inn

EUREF89 UTM sone 32, 2d
type: Concept
in scheme: EPSG koder
top concept of: EPSG koder
definition: UTM er en Gauss-Krüger projeksjon med 6° sonebredde. Berøringsmeridianen er 9° øst for Greenwich.
description: UTM er en Gauss-Krüger projeksjon med 6° sonebredde. Berøringsmeridianen er 9° øst for Greenwich.
status: Gyldig

EUREF89 UTM sone 36, 2d + NN54
type: Concept
in scheme: EPSG koder
top concept of: EPSG koder
definition: Koordinatsystemet er sammensatt og angir vertikalt datum NN54 i tillegg til UTM sone 36 i EUREF89. Dekker Norges fastland mellom 30°E og 36°E. Berøringsmeridianen er 33° øst for Greenwich.
description: Koordinatsystemet er sammensatt og angir vertikalt datum NN54 i tillegg til UTM sone 36 i EUREF89. Dekker Norges fastland mellom 30°E og 36°E. Berøringsmeridianen er 33° øst for Greenwich.
status: Sendt inn

EUREF89 NTM Sone24, 2d + NN54
type: Concept
in scheme: EPSG koder
top concept of: EPSG koder
definition: Koordinatsystemet er sammensatt og angir vertikalt datum NN54 i tillegg til Norsk Transversal Mercator sone 24 (basert på EUREF89)
description: Koordinatsystemet er sammensatt og angir vertikalt datum NN54 i tillegg til Norsk Transversal Mercator sone 24 (basert på EUREF89)
status: Sendt inn

North Pole LAEA Europe, basert på WGS84
type: Concept
in scheme: EPSG koder
top concept of: EPSG koder
definition: Arealriktig planprojeksjon. Passer for den nordlige halvkule nord for 45°N, inkludert Arktis. Orientert mot Europa med sentralmeridian 10° øst for Greenwich.
description: Arealriktig planprojeksjon. Passer for den nordlige halvkule nord for 45°N, inkludert Arktis. Orientert mot Europa med sentralmeridian 10° øst for Greenwich.
status: Sendt inn

EUREF89 UTM sone 35, 2d
type: Concept
in scheme: EPSG koder
top concept of: EPSG koder
definition: UTM er en Gauss-Krüger projeksjon med 6° sonebredde. Berøringsmeridianen er 27° øst for Greenwich.
description: UTM er en Gauss-Krüger projeksjon med 6° sonebredde. Berøringsmeridianen er 27° øst for Greenwich.
status: Sendt inn

North Pole LAEA Canada, basert på WGS84
type: Concept
in scheme: EPSG koder
top concept of: EPSG koder
definition: Arealriktig planprojeksjon. Passer for den nordlige halvkule nord for 45°N, inkludert Arktis. Orientert mot Canada.
description: Arealriktig planprojeksjon. Passer for den nordlige halvkule nord for 45°N, inkludert Arktis. Orientert mot Canada.
status: Sendt inn

EUREF89 UTM sone 33, 2d + NN54
type: Concept
in scheme: EPSG koder
top concept of: EPSG koder
definition: Koordinatsystemet er sammensatt og angir vertikalt datum NN54 i tillegg til UTM sone 33 i EUREF89. Dekker Norges fastland mellom 12°E og 18°E. Berøringsmeridianen er 15° øst for Greenwich.
description: Koordinatsystemet er sammensatt og angir vertikalt datum NN54 i tillegg til UTM sone 33 i EUREF89. Dekker Norges fastland mellom 12°E og 18°E. Berøringsmeridianen er 15° øst for Greenwich.
status: Sendt inn

EUREF89 NTM Sone 30, 2d + NN2000
type: Concept
in scheme: EPSG koder
top concept of: EPSG koder
definition: Koordinatsystemet er sammensatt og angir vertikalt datum NN2000 i tillegg til Norsk Transversal Mercator sone 30 (basert på EUREF89)
description: Koordinatsystemet er sammensatt og angir vertikalt datum NN2000 i tillegg til Norsk Transversal Mercator sone 30 (basert på EUREF89)
status: Sendt inn

EUREF89 NTM Sone 21, 2d
type: Concept
in scheme: EPSG koder
top concept of: EPSG koder
definition: Norsk Transversal Mercator sone 21 (basert på EUREF89)
description: Norsk Transversal Mercator sone 21 (basert på EUREF89)
status: Sendt inn

EUREF89 NTM Sone 9, 2d
type: Concept
in scheme: EPSG koder
top concept of: EPSG koder
definition: Norsk Transversal Mercator sone 9 (basert på EUREF89)
description: Norsk Transversal Mercator sone 9 (basert på EUREF89)
status: Sendt inn

North Pole LAEA Russia, basert på WGS84
type: Concept
in scheme: EPSG koder
top concept of: EPSG koder
definition: Arealriktig planprojeksjon. Passer for den nordlige halvkule nord for 45°N, inkludert Arktis. Orientert mot Russland.
description: Arealriktig planprojeksjon. Passer for den nordlige halvkule nord for 45°N, inkludert Arktis. Orientert mot Russland.
status: Sendt inn

EUREF 89 Geografisk (ETRS 89) 2d
type: Concept
in scheme: EPSG koder
top concept of: EPSG koder
definition: Geodetisk koordinatsystem i 2 dimensjoner uten projeksjon
description: Geodetisk koordinatsystem i 2 dimensjoner uten projeksjon
status: Sendt inn

EUREF89 NTM Sone 5, 2d
type: Concept
in scheme: EPSG koder
top concept of: EPSG koder
definition: Norsk Transversal Mercator sone 5 (basert på EUREF89)
description: Norsk Transversal Mercator sone 5 (basert på EUREF89)
status: Sendt inn